program: Orca
programVersion: 4.2.1
elementType: S O O O O O O N N N N N N C C C C C C C C C C C C C C C H H H H H H H H H H H H H H H H H H
charge: 0
multiplicity: 1
keywords: wb97x-d3
keywords: def2-TZVPP
keywords: def2/J RIJCOSX GRIDX6 NOFINALGRIDX
keywords: grid4 nofinalgrid
keywords: scfconv7
keywords: smallprint printgap noloewdin
keywords: NOSOSCF
formula: C15H18N6O6S
InChI: InChI=1S/C15H18N6O6S/c1-4-27-15-19-12(16-2)17-13(20-15)18-14(23)21-28(24,25)10-8-6-5-7-9(10)11(22)26-3/h5-8,16,18,21H,4H2,1-3H3
46 atoms
S  1.854325 -0.117343 -1.43258
O  1.886343 1.333641 -1.3844
O  2.113206 -0.805472 -2.678718
O  1.245175 1.001235 1.502712
O  3.123464 2.189155 1.739739
O  -2.94713 2.443756 -0.621267
O  0.605131 -2.744394 -0.773934
N  0.326147 -0.494709 -0.906307
N  -1.400369 -1.870207 -0.207025
N  -3.536693 -1.353338 0.365507
N  -2.089079 0.3429 -0.384678
N  -4.313036 0.87856 0.150372
N  -5.667056 -0.752575 0.97392
C  2.977069 -0.755059 -0.214935
C  3.254657 -0.047635 0.956275
C  3.67976 -1.9064 -0.536778
C  4.259838 -0.516339 1.791934
C  4.659063 -2.37541 0.324836
C  4.950872 -1.678915 1.485074
C  2.546326 1.186197 1.411318
C  -0.097865 -1.766558 -0.651573
C  -2.376568 -0.915748 -0.068458
C  -4.480365 -0.409839 0.487965
C  -3.11376 1.184998 -0.279768
C  -1.699544 2.893818 -1.17184
C  0.466305 2.084182 2.016504
C  -1.526141 2.521121 -2.625304
C  -6.06784 -2.080474 1.366129
H  3.480531 -2.436473 -1.456397
H  -0.347719 0.271091 -0.759475
H  4.496991 0.023967 2.698716
H  5.199551 -3.278196 0.076153
H  5.722425 -2.033598 2.154832
H  -1.738196 3.976028 -1.060801
H  -0.864257 2.538189 -0.566236
H  -6.358021 -0.019907 1.011177
H  0.748337 2.315373 3.043785
H  0.56908 2.980734 1.405751
H  -0.564766 1.743261 2.002088
H  -0.607735 2.977729 -2.995772
H  -1.447451 1.445725 -2.781473
H  -2.350804 2.898039 -3.230658
H  -6.677882 -2.02176 2.265736
H  -5.197057 -2.692242 1.581082
H  -6.652072 -2.5718 0.585459
H  -1.689415 -2.813358 0.019393
elementType: S O N C H
totalener: -1760.73344160 hartree
nucrepener: 3049.07859728 hartree
electener: -4809.81203887 hartree
oneelecener: -8475.28904183 hartree
twoeener: 3665.47700295 hartree
cpcmener: -0.04631421 hartree
kineticenergy: 1754.38285494 hartree
xcener: -145.160568619618 hartree
chargesum: -0.0000000
charge: 0.878860 -0.510073 -0.494666 -0.261507 -0.425956 -0.283739 -0.455328 -0.182842 -0.138315 -0.444040 -0.455532 -0.396354 -0.169913 -0.147068 0.080457 0.012967 -0.206687 -0.170324 -0.100376 0.452417 0.371154 0.378807 0.396342 0.409054 0.077484 -0.147669 -0.278135 -0.152025 0.141303 0.191392 0.147570 0.165130 0.165381 0.123072 0.045343 0.176509 0.142553 0.122658 0.124769 0.101859 0.084293 0.103670 0.115533 0.109200 0.112319 0.190455
qa: 0.8789 -0.5101 -0.4947 -0.2615 -0.4260 -0.2837 -0.4553 -0.1828 -0.1383 -0.4440 -0.4555 -0.3964 -0.1699 -0.1471 0.0805 0.0130 -0.2067 -0.1703 -0.1004 0.4524 0.3712 0.3788 0.3963 0.4091 0.0775 -0.1477 -0.2781 -0.1520 0.1413 0.1914 0.1476 0.1651 0.1654 0.1231 0.0453 0.1765 0.1426 0.1227 0.1248 0.1019 0.0843 0.1037 0.1155 0.1092 0.1123 0.1905
va: 5.8008 1.9761 2.0081 2.1081 2.0791 2.1241 2.0691 3.0913 3.1895 2.9811 2.8856 2.9712 3.2235 3.8439 3.6873 3.8263 4.0298 3.9556 3.8999 4.1072 4.4124 4.2455 4.2188 4.2926 3.8434 3.8382 3.9321 3.8782 1.0257 1.0762 1.0096 0.9884 0.9866 0.9980 1.0020 1.0134 0.9982 0.9885 0.9963 1.0081 1.0120 1.0061 0.9932 1.0122 0.9896 1.0187
dispcorr: -0.027136356 hartree
energy: -1760.760577954498
dipole: -13.33195 10.83174 -2.50021 4.05633 -5.16299 -1.10667 4.82779 -2.46381 2.36398
magnitude: 3.61444 au
magnitude: 9.18718 debye
