program: Orca
programVersion: 4.2.1
elementType: S O O O O O O N N N N N N C C C C C C C C C C C C C C C H H H H H H H H H H H H H H H H H H
charge: 0
multiplicity: 1
keywords: wb97x-d3
keywords: def2-TZVPP
keywords: def2/J RIJCOSX GRIDX6 NOFINALGRIDX
keywords: grid4 nofinalgrid
keywords: scfconv7
keywords: smallprint printgap noloewdin
keywords: NOSOSCF
formula: C15H18N6O6S
InChI: InChI=1S/C15H18N6O6S/c1-4-27-15-19-12(16-2)17-13(20-15)18-14(23)21-28(24,25)10-8-6-5-7-9(10)11(22)26-3/h5-8,16,18,21H,4H2,1-3H3
46 atoms
S  1.520582 -2.065893 0.046312
O  1.775373 -3.126411 -0.902348
O  1.084549 -2.384899 1.393136
O  2.45969 -0.378291 3.461624
O  1.049639 0.598539 2.023577
O  -4.696906 2.45663 -1.824396
O  1.269705 -0.691979 -2.568791
N  0.324541 -1.072442 -0.537285
N  -0.717633 0.275034 -2.112422
N  -1.959414 0.147032 -0.157262
N  -2.699118 1.384438 -2.016613
N  -4.020391 1.300178 -0.061639
N  -3.260133 0.082269 1.718434
C  2.965333 -1.045818 0.151516
C  3.146633 -0.200341 1.245501
C  3.939081 -1.17572 -0.82603
C  4.331134 0.515083 1.345691
C  5.107249 -0.436082 -0.722966
C  5.30231 0.404476 0.360427
C  2.085215 0.038102 2.271384
C  0.362257 -0.518818 -1.78631
C  -1.832352 0.606083 -1.386013
C  -3.081211 0.520964 0.479121
C  -3.769231 1.690275 -1.294804
C  -4.536545 2.93384 -3.169222
C  1.542022 -0.187618 4.542262
C  -5.749359 3.764461 -3.501228
C  -2.319726 -0.75629 2.422007
H  3.800039 -1.849312 -1.659011
H  -0.457311 -0.807293 0.083591
H  4.494547 1.173656 2.188595
H  5.865605 -0.52723 -1.488184
H  6.216148 0.976556 0.446683
H  -3.62405 3.528206 -3.244781
H  -4.443904 2.088159 -3.853193
H  -4.102777 0.373553 2.186122
H  2.0327 -0.592444 5.422453
H  1.325275 0.868306 4.701184
H  0.612217 -0.729272 4.368307
H  -5.844238 4.62516 -2.838562
H  -5.653892 4.138832 -4.520576
H  -6.667634 3.17901 -3.446871
H  -1.349694 -0.271861 2.529995
H  -2.177627 -1.716965 1.925362
H  -2.716231 -0.947888 3.415091
H  -0.67745 0.671598 -3.042474
elementType: S O N C H
totalener: -1760.73781972 hartree
nucrepener: 2980.63295624 hartree
electener: -4741.37077596 hartree
oneelecener: -8339.52556189 hartree
twoeener: 3598.15478593 hartree
cpcmener: -0.04520016 hartree
kineticenergy: 1754.38639326 hartree
xcener: -145.158081050309 hartree
chargesum: -0.0000000
charge: 0.877066 -0.490090 -0.506937 -0.265996 -0.420439 -0.279602 -0.456980 -0.204394 -0.136846 -0.439656 -0.445952 -0.401868 -0.177214 -0.123411 0.073140 -0.011269 -0.191353 -0.167559 -0.108971 0.437878 0.371383 0.370964 0.393432 0.424852 0.050351 -0.126600 -0.254550 -0.171764 0.145213 0.227339 0.147430 0.164587 0.165262 0.096006 0.096539 0.174459 0.135574 0.121627 0.115243 0.089297 0.089665 0.088682 0.095045 0.110985 0.128504 0.190927
qa: 0.8771 -0.4901 -0.5069 -0.2660 -0.4204 -0.2796 -0.4570 -0.2044 -0.1368 -0.4397 -0.4460 -0.4019 -0.1772 -0.1234 0.0731 -0.0113 -0.1914 -0.1676 -0.1090 0.4379 0.3714 0.3710 0.3934 0.4249 0.0504 -0.1266 -0.2546 -0.1718 0.1452 0.2273 0.1474 0.1646 0.1653 0.0960 0.0965 0.1745 0.1356 0.1216 0.1152 0.0893 0.0897 0.0887 0.0950 0.1110 0.1285 0.1909
va: 5.8216 2.0135 1.9810 2.1355 2.0779 2.1217 2.0641 3.0872 3.1864 2.9726 2.9363 2.9733 3.2279 3.7755 3.7028 3.8499 4.0265 3.9508 3.8989 4.1071 4.4146 4.2641 4.1919 4.3066 3.8207 3.8614 3.9671 3.8886 1.0243 1.0427 1.0064 0.9884 0.9867 0.9976 0.9977 1.0163 0.9944 0.9934 0.9904 1.0033 1.0056 1.0036 1.0020 0.9951 0.9985 1.0183
dispcorr: -0.024732384 hartree
energy: -1760.762552108768
dipole: -12.59384 12.66981 0.07596 13.52249 -11.34577 2.17672 3.51060 -2.09078 1.41982
magnitude: 2.59995 au
magnitude: 6.60856 debye
