program: Orca
programVersion: 4.2.1
elementType: S O O O O O O N N N N N N C C C C C C C C C C C C C C C H H H H H H H H H H H H H H H H H H
charge: 0
multiplicity: 1
keywords: wb97x-d3
keywords: def2-TZVPP
keywords: def2/J RIJCOSX GRIDX6 NOFINALGRIDX
keywords: grid4 nofinalgrid
keywords: scfconv7
keywords: smallprint printgap noloewdin
keywords: NOSOSCF
formula: C15H18N6O6S
InChI: InChI=1S/C15H18N6O6S/c1-4-27-15-19-12(16-2)17-13(20-15)18-14(23)21-28(24,25)10-8-6-5-7-9(10)11(22)26-3/h5-8,16,18,21H,4H2,1-3H3
46 atoms
S  2.015418 -0.444016 -1.659192
O  2.147439 0.973349 -1.940111
O  2.371494 -1.414514 -2.670519
O  3.034929 2.435446 1.044946
O  1.050923 1.421984 0.856374
O  -5.24534 0.0598 1.335402
O  0.552145 -2.830085 -0.686994
N  0.416435 -0.632938 -1.253068
N  -1.36505 -1.723716 -0.243429
N  -1.853435 0.507715 -0.641449
N  -3.326873 -0.887038 0.547744
N  -3.882994 1.379974 0.196803
N  -2.419771 2.694008 -0.971734
C  2.927758 -0.818502 -0.183451
C  3.041999 0.118846 0.845204
C  3.608286 -2.024352 -0.131757
C  3.858151 -0.179372 1.927824
C  4.400838 -2.31521 0.968457
C  4.525572 -1.394295 1.994189
C  2.253207 1.386942 0.891347
C  -0.077813 -1.79712 -0.733858
C  -2.205816 -0.647211 -0.11441
C  -2.728136 1.509104 -0.460366
C  -4.115759 0.172939 0.671035
C  -5.611498 -1.197063 1.925837
C  2.401002 3.709179 1.192806
C  -6.243629 -2.13822 0.928808
C  -1.205472 2.967582 -1.701652
H  3.534576 -2.735171 -0.94166
H  -0.176926 0.20964 -1.173202
H  3.963221 0.531151 2.736846
H  4.924039 -3.260306 1.013535
H  5.147661 -1.614966 2.850936
H  -4.747326 -1.652596 2.410049
H  -6.326742 -0.927385 2.701652
H  -3.084772 3.436898 -0.832111
H  3.205946 4.428596 1.310234
H  1.815608 3.964949 0.30983
H  1.760924 3.734409 2.074403
H  -6.585824 -3.031097 1.453853
H  -7.110829 -1.685149 0.447348
H  -5.541062 -2.454832 0.158908
H  -0.318484 2.802365 -1.089439
H  -1.219604 4.01217 -1.999692
H  -1.125064 2.359711 -2.603709
H  -1.707919 -2.587793 0.156136
elementType: S O N C H
totalener: -1760.73578603 hartree
nucrepener: 3014.83957209 hartree
electener: -4775.57535812 hartree
oneelecener: -8408.04885779 hartree
twoeener: 3632.47349967 hartree
cpcmener: -0.04501161 hartree
kineticenergy: 1754.38889536 hartree
xcener: -145.159537953791 hartree
chargesum: 0.0000000
charge: 0.883615 -0.508636 -0.494726 -0.270306 -0.421616 -0.289645 -0.454117 -0.203667 -0.139420 -0.431302 -0.448260 -0.398547 -0.174804 -0.145222 0.080113 -0.001923 -0.195698 -0.166294 -0.106461 0.450411 0.360574 0.367557 0.390767 0.426981 0.062481 -0.125853 -0.271049 -0.164516 0.144509 0.224590 0.146393 0.165953 0.165130 0.087662 0.113344 0.174488 0.134365 0.117883 0.120615 0.094884 0.089357 0.091439 0.083044 0.127679 0.118086 0.190142
qa: 0.8836 -0.5086 -0.4947 -0.2703 -0.4216 -0.2896 -0.4541 -0.2037 -0.1394 -0.4313 -0.4483 -0.3985 -0.1748 -0.1452 0.0801 -0.0019 -0.1957 -0.1663 -0.1065 0.4504 0.3606 0.3676 0.3908 0.4270 0.0625 -0.1259 -0.2710 -0.1645 0.1445 0.2246 0.1464 0.1660 0.1651 0.0877 0.1133 0.1745 0.1344 0.1179 0.1206 0.0949 0.0894 0.0914 0.0830 0.1277 0.1181 0.1901
va: 5.8197 1.9807 2.0057 2.1380 2.0724 2.1218 2.0664 3.0782 3.1938 2.9723 2.9228 2.9767 3.2221 3.7938 3.6789 3.8389 4.0305 3.9544 3.9005 4.0888 4.4244 4.2554 4.1953 4.3024 3.8195 3.8667 3.9251 3.8941 1.0245 1.0512 1.0103 0.9877 0.9868 1.0153 0.9931 1.0159 0.9941 0.9876 0.9930 1.0071 1.0044 1.0105 0.9949 0.9986 0.9930 1.0184
dispcorr: -0.025455770 hartree
energy: -1760.761241799477
dipole: -12.71201 12.41018 -0.30183 5.68903 -4.37969 1.30934 9.00855 -6.45192 2.55663
magnitude: 2.88822 au
magnitude: 7.34127 debye
