program: Orca
programVersion: 4.2.1
elementType: S O O O O O O N N N N N N C C C C C C C C C C C C C C C H H H H H H H H H H H H H H H H H H
charge: 0
multiplicity: 1
keywords: wb97x-d3
keywords: def2-TZVPP
keywords: def2/J RIJCOSX GRIDX6 NOFINALGRIDX
keywords: grid4 nofinalgrid
keywords: scfconv7
keywords: smallprint printgap noloewdin
keywords: NOSOSCF
formula: C15H18N6O6S
InChI: InChI=1S/C15H18N6O6S/c1-4-27-15-19-12(16-2)17-13(20-15)18-14(23)21-28(24,25)10-8-6-5-7-9(10)11(22)26-3/h5-8,16,18,21H,4H2,1-3H3
46 atoms
S  1.852158 -0.369299 -1.49121
O  1.870413 1.075445 -1.624882
O  2.220568 -1.202746 -2.61393
O  2.825421 2.313787 1.381117
O  0.907912 1.170958 1.250053
O  -2.868864 2.297562 -0.47822
O  0.580624 -2.953338 -0.779277
N  0.293679 -0.714244 -1.037461
N  -1.426691 -2.061708 -0.258108
N  -3.538791 -1.517327 0.377997
N  -2.081789 0.162989 -0.388228
N  -4.270239 0.737827 0.2480
N  -5.657913 -0.914054 0.986605
C  2.863954 -0.821711 -0.106281
C  2.975096 0.023778 0.998931
C  3.620794 -1.978245 -0.202478
C  3.867019 -0.313432 2.007356
C  4.489134 -2.312556 0.826089
C  4.612749 -1.481157 1.925922
C  2.1091 1.224857 1.198144
C  -0.124963 -1.972133 -0.70603
C  -2.38355 -1.093769 -0.085295
C  -4.4626 -0.559008 0.53017
C  -3.072352 1.029799 -0.199213
C  -1.583635 2.716783 -0.96712
C  2.117255 3.524863 1.66086
C  -1.645471 4.204882 -1.19503
C  -6.012485 -2.254046 1.383191
H  3.548556 -2.615778 -1.071511
H  -0.357279 0.066852 -0.86396
H  3.971465 0.327702 2.872507
H  5.073234 -3.219724 0.75644
H  5.294427 -1.735451 2.72615
H  -0.815312 2.469605 -0.232622
H  -1.353019 2.19373 -1.897736
H  -6.323943 -0.172949 1.13122
H  1.485863 3.813831 0.820551
H  1.50844 3.43319 2.559822
H  2.877935 4.284366 1.814866
H  -2.398166 4.469674 -1.937872
H  -1.856836 4.746659 -0.272828
H  -0.678697 4.54499 -1.567145
H  -5.514242 -2.5561 2.30529
H  -5.767025 -2.977377 0.608734
H  -7.084901 -2.286033 1.549694
H  -1.718622 -2.999898 -0.015708
elementType: S O N C H
totalener: -1760.73730953 hartree
nucrepener: 3020.24707144 hartree
electener: -4780.98438096 hartree
oneelecener: -8418.93350720 hartree
twoeener: 3637.94912624 hartree
cpcmener: -0.04489071 hartree
kineticenergy: 1754.38661413 hartree
xcener: -145.158573370824 hartree
chargesum: 0.0000000
charge: 0.881578 -0.508624 -0.493111 -0.269440 -0.425755 -0.281156 -0.456022 -0.200273 -0.135008 -0.442487 -0.442966 -0.398375 -0.182638 -0.131747 0.075127 -0.004887 -0.195383 -0.165925 -0.107014 0.447333 0.365603 0.366475 0.403865 0.413582 0.071247 -0.121761 -0.277722 -0.154054 0.145404 0.222990 0.147458 0.165533 0.165245 0.071681 0.100770 0.176834 0.113932 0.121067 0.135144 0.096286 0.093586 0.090447 0.112425 0.104869 0.116598 0.189271
qa: 0.8816 -0.5086 -0.4931 -0.2694 -0.4258 -0.2812 -0.4560 -0.2003 -0.1350 -0.4425 -0.4430 -0.3984 -0.1826 -0.1317 0.0751 -0.0049 -0.1954 -0.1659 -0.1070 0.4473 0.3656 0.3665 0.4039 0.4136 0.0712 -0.1218 -0.2777 -0.1541 0.1454 0.2230 0.1475 0.1655 0.1652 0.0717 0.1008 0.1768 0.1139 0.1211 0.1351 0.0963 0.0936 0.0904 0.1124 0.1049 0.1166 0.1893
va: 5.8191 1.9795 2.0084 2.1408 2.0709 2.1335 2.0656 3.0845 3.1852 2.9729 2.9230 2.9749 3.2118 3.7873 3.6899 3.8433 4.0318 3.9526 3.9020 4.0929 4.4213 4.2718 4.2142 4.2985 3.8023 3.8633 3.9865 3.8917 1.0241 1.0511 1.0093 0.9879 0.9869 1.0007 0.9944 1.0143 0.9900 0.9941 0.9944 1.0045 1.0017 1.0047 0.9929 0.9990 0.9963 1.0196
dispcorr: -0.025169441 hartree
energy: -1760.762478966462
dipole: -9.24161 8.39063 -0.85097 11.82150 -11.40583 0.41568 8.72778 -5.79124 2.93653
magnitude: 3.08548 au
magnitude: 7.84266 debye
