program: Orca
programVersion: 4.2.1
elementType: S O O O O O O N N N N N N C C C C C C C C C C C C C C C H H H H H H H H H H H H H H H H H H
charge: 0
multiplicity: 1
keywords: wb97x-d3
keywords: def2-TZVPP
keywords: def2/J RIJCOSX GRIDX6 NOFINALGRIDX
keywords: grid4 nofinalgrid
keywords: scfconv7
keywords: smallprint printgap noloewdin
keywords: NOSOSCF
formula: C15H18N6O6S
InChI: InChI=1S/C15H18N6O6S/c1-4-27-15-19-12(16-2)17-13(20-15)18-14(23)21-28(24,25)10-8-6-5-7-9(10)11(22)26-3/h5-8,16,18,21H,4H2,1-3H3
46 atoms
S  1.855337 -0.358749 -1.4873
O  1.878327 1.086976 -1.610316
O  2.226428 -1.183992 -2.61538
O  2.833366 2.304991 1.389408
O  0.909969 1.17069 1.260568
O  -2.864561 2.307123 -0.452999
O  0.582597 -2.942969 -0.789457
N  0.293666 -0.703994 -1.044932
N  -1.430232 -2.056819 -0.281287
N  -3.538991 -1.514853 0.366966
N  -2.083061 0.169432 -0.392806
N  -4.26647 0.742676 0.262041
N  -5.656432 -0.913751 0.985435
C  2.860742 -0.823753 -0.102335
C  2.971804 0.014671 1.008132
C  3.615446 -1.981332 -0.204185
C  3.859718 -0.331295 2.017048
C  4.481337 -2.323447 0.82367
C  4.603567 -1.499734 1.92948
C  2.111318 1.21958 1.208653
C  -0.125336 -1.963249 -0.718326
C  -2.38525 -1.089101 -0.097675
C  -4.461035 -0.556846 0.530523
C  -3.070231 1.036595 -0.188127
C  -1.580102 2.728795 -0.942087
C  2.132129 3.522789 1.657783
C  -1.640282 4.218776 -1.156777
C  -6.015301 -2.256363 1.368815
H  3.543583 -2.613216 -1.077285
H  -0.357838 0.076257 -0.869131
H  3.963076 0.304022 2.886574
H  5.064732 -3.230645 0.74886
H  5.283036 -1.760613 2.729421
H  -0.810209 2.474105 -0.211884
H  -1.352973 2.213612 -1.877834
H  -6.318856 -0.171826 1.14287
H  1.505001 3.808814 0.813323
H  1.520651 3.442419 2.555884
H  2.897428 4.278514 1.807261
H  -0.675447 4.559697 -1.532968
H  -2.397386 4.491434 -1.892059
H  -1.843714 4.753416 -0.228746
H  -5.535659 -2.561239 2.299208
H  -5.751619 -2.974621 0.596582
H  -7.090421 -2.293086 1.512599
H  -1.72111 -2.996004 -0.041539
elementType: S O N C H
totalener: -1760.73719853 hartree
nucrepener: 3020.46619997 hartree
electener: -4781.20339850 hartree
oneelecener: -8419.36577500 hartree
twoeener: 3638.16237650 hartree
cpcmener: -0.04477430 hartree
kineticenergy: 1754.39023204 hartree
xcener: -145.159262905339 hartree
chargesum: 0.0000000
charge: 0.881560 -0.508577 -0.493607 -0.269109 -0.424440 -0.281247 -0.456096 -0.200489 -0.135085 -0.442514 -0.442652 -0.398390 -0.182461 -0.131295 0.075056 -0.005467 -0.194797 -0.165816 -0.107215 0.446188 0.365715 0.366769 0.403401 0.413477 0.070574 -0.121882 -0.277781 -0.154145 0.145066 0.223318 0.147281 0.165567 0.165202 0.072110 0.100664 0.176988 0.113716 0.121194 0.135260 0.090491 0.096119 0.093802 0.112746 0.104832 0.116675 0.189295
qa: 0.8816 -0.5086 -0.4936 -0.2691 -0.4244 -0.2812 -0.4561 -0.2005 -0.1351 -0.4425 -0.4427 -0.3984 -0.1825 -0.1313 0.0751 -0.0055 -0.1948 -0.1658 -0.1072 0.4462 0.3657 0.3668 0.4034 0.4135 0.0706 -0.1219 -0.2778 -0.1541 0.1451 0.2233 0.1473 0.1656 0.1652 0.0721 0.1007 0.1770 0.1137 0.1212 0.1353 0.0905 0.0961 0.0938 0.1127 0.1048 0.1167 0.1893
va: 5.8191 1.9793 2.0079 2.1401 2.0719 2.1334 2.0655 3.0846 3.1853 2.9731 2.9235 2.9747 3.2121 3.7863 3.6900 3.8443 4.0310 3.9520 3.9020 4.0945 4.4211 4.2713 4.2146 4.2986 3.8023 3.8632 3.9866 3.8913 1.0244 1.0508 1.0093 0.9879 0.9869 1.0009 0.9943 1.0141 0.9902 0.9940 0.9944 1.0047 1.0046 1.0016 0.9927 0.9996 0.9963 1.0196
dispcorr: -0.025179304 hartree
energy: -1760.762377836628
dipole: -9.23251 8.36716 -0.86536 11.78747 -11.39340 0.39407 8.74621 -5.82158 2.92464
magnitude: 3.07533 au
magnitude: 7.81686 debye
