program: Orca
programVersion: 4.2.1
elementType: S O O O O O O N N N N N N C C C C C C C C C C C C C C C H H H H H H H H H H H H H H H H H H
charge: 0
multiplicity: 1
keywords: wb97x-d3
keywords: def2-TZVPP
keywords: def2/J RIJCOSX GRIDX6 NOFINALGRIDX
keywords: grid4 nofinalgrid
keywords: scfconv7
keywords: smallprint printgap noloewdin
keywords: NOSOSCF
formula: C15H18N6O6S
InChI: InChI=1S/C15H18N6O6S/c1-4-27-15-19-12(16-2)17-13(20-15)18-14(23)21-28(24,25)10-8-6-5-7-9(10)11(22)26-3/h5-8,16,18,21H,4H2,1-3H3
46 atoms
S  1.473981 -2.091693 0.266274
O  1.65571 -3.324758 -0.466722
O  1.056273 -2.130918 1.655166
O  2.619563 0.357375 3.236912
O  1.136984 0.882096 1.645306
O  -4.337584 2.524638 -2.399024
O  1.241923 -1.213319 -2.553756
N  0.314119 -1.169077 -0.480171
N  -0.66442 -0.042656 -2.257592
N  -1.893545 0.22905 -0.307888
N  -2.533262 1.246278 -2.333273
N  -3.837838 1.56772 -0.393016
N  -3.19311 0.539648 1.544331
C  2.973102 -1.150772 0.153789
C  3.218999 -0.101684 1.040348
C  3.930752 -1.554188 -0.76306
C  4.450015 0.537072 0.990062
C  5.147711 -0.891303 -0.813567
C  5.405534 0.150857 0.060644
C  2.191245 0.418367 1.993272
C  0.362594 -0.844477 -1.807177
C  -1.739148 0.493436 -1.593818
C  -2.969933 0.785896 0.260685
C  -3.563157 1.757536 -1.663656
C  -5.495089 3.144249 -1.81876
C  1.757066 0.871768 4.255141
C  -6.679017 2.208635 -1.768436
C  -2.352652 -0.298762 2.364653
H  3.742369 -2.382441 -1.430413
H  -0.435974 -0.749884 0.091627
H  4.663976 1.350996 1.670027
H  5.893731 -1.200054 -1.532702
H  6.356811 0.664402 0.029676
H  -5.257102 3.538691 -0.830689
H  -5.703409 3.987508 -2.475776
H  -4.006129 0.968937 1.954731
H  2.294035 0.743627 5.190159
H  1.543347 1.929072 4.101137
H  0.822302 0.312879 4.297592
H  -6.911537 1.807241 -2.75521
H  -6.518268 1.37805 -1.081933
H  -7.552768 2.762241 -1.422333
H  -2.271137 -1.308981 1.962922
H  -2.802781 -0.363948 3.350906
H  -1.349727 0.114568 2.474495
H  -0.60684 0.195136 -3.239486
elementType: S O N C H
totalener: -1760.73709399 hartree
nucrepener: 2987.16809701 hartree
electener: -4747.90519100 hartree
oneelecener: -8352.81291036 hartree
twoeener: 3604.90771936 hartree
cpcmener: -0.04583477 hartree
kineticenergy: 1754.38685035 hartree
xcener: -145.159177199476 hartree
chargesum: 0.0000000
charge: 0.879140 -0.493366 -0.509010 -0.268328 -0.421603 -0.289466 -0.458363 -0.200443 -0.134724 -0.443015 -0.416180 -0.432204 -0.182351 -0.127407 0.073743 -0.009098 -0.194106 -0.164758 -0.109705 0.442248 0.369774 0.378141 0.384213 0.434209 0.060542 -0.128336 -0.271253 -0.168564 0.144940 0.227577 0.147730 0.165014 0.165466 0.087543 0.113192 0.176259 0.134936 0.120938 0.117973 0.090288 0.090992 0.094993 0.110122 0.127951 0.095242 0.189115
qa: 0.8791 -0.4934 -0.5090 -0.2683 -0.4216 -0.2895 -0.4584 -0.2004 -0.1347 -0.4430 -0.4162 -0.4322 -0.1824 -0.1274 0.0737 -0.0091 -0.1941 -0.1648 -0.1097 0.4422 0.3698 0.3781 0.3842 0.4342 0.0605 -0.1283 -0.2713 -0.1686 0.1449 0.2276 0.1477 0.1650 0.1655 0.0875 0.1132 0.1763 0.1349 0.1209 0.1180 0.0903 0.0910 0.0950 0.1101 0.1280 0.0952 0.1891
va: 5.8222 2.0089 1.9791 2.1362 2.0760 2.1236 2.0630 3.0880 3.1869 2.9668 2.9643 2.9264 3.2334 3.7869 3.6938 3.8479 4.0289 3.9507 3.9034 4.1009 4.4181 4.2452 4.2009 4.2887 3.8214 3.8633 3.9253 3.8924 1.0243 1.0405 1.0086 0.9881 0.9869 1.0160 0.9930 1.0142 0.9944 0.9934 0.9892 1.0044 1.0099 1.0071 0.9955 0.9985 0.9991 1.0206
dispcorr: -0.024950146 hartree
energy: -1760.762044140416
dipole: -16.92659 16.18248 -0.74412 12.93232 -10.22373 2.70859 10.18276 -7.75539 2.42737
magnitude: 3.71245 au
magnitude: 9.43630 debye
