program: Orca
programVersion: 4.2.1
elementType: S O O O O O O N N N N N N C C C C C C C C C C C C C C C H H H H H H H H H H H H H H H H H H
charge: 0
multiplicity: 1
keywords: wb97x-d3
keywords: def2-TZVPP
keywords: def2/J RIJCOSX GRIDX6 NOFINALGRIDX
keywords: grid4 nofinalgrid
keywords: scfconv7
keywords: smallprint printgap noloewdin
keywords: NOSOSCF
formula: C15H18N6O6S
InChI: InChI=1S/C15H18N6O6S/c1-4-27-15-19-12(16-2)17-13(20-15)18-14(23)21-28(24,25)10-8-6-5-7-9(10)11(22)26-3/h5-8,16,18,21H,4H2,1-3H3
46 atoms
S  1.832064 0.028334 1.639311
O  2.191887 -0.495913 2.937656
O  1.851614 1.459781 1.401329
O  2.845434 1.951892 -1.705542
O  0.917846 0.849322 -1.437573
O  -2.819244 2.345401 -0.226246
O  0.554521 -2.648942 1.587675
N  0.274893 -0.415777 1.273496
N  -1.426169 -1.917387 0.789714
N  -3.474106 -1.563627 -0.124027
N  -2.059663 0.26604 0.30906
N  -4.173301 0.641043 -0.649308
N  -5.526054 -1.13777 -1.066638
C  2.847702 -0.759328 0.417338
C  2.963764 -0.213612 -0.861688
C  3.591094 -1.866099 0.794843
C  3.845131 -0.799602 -1.758827
C  4.451172 -2.453056 -0.1213
C  4.578009 -1.920208 -1.39297
C  2.115436 0.918347 -1.342965
C  -0.140884 -1.7177 1.248083
C  -2.353857 -1.028985 0.306297
C  -4.367048 -0.685959 -0.601332
C  -3.015932 1.046751 -0.184856
C  -1.578843 2.890816 0.251391
C  2.154918 3.089346 -2.229346
C  -1.625663 4.381878 0.037907
C  -5.944252 -2.515487 -1.123858
H  3.512923 -2.270709 1.793449
H  -0.365818 0.296405 0.889816
H  3.953049 -0.390992 -2.754918
H  5.025836 -3.322094 0.167999
H  5.253517 -2.371845 -2.106871
H  -1.453976 2.654729 1.310487
H  -0.74828 2.448862 -0.300827
H  -6.164035 -0.437851 -1.411829
H  1.493224 3.526482 -1.480933
H  2.923911 3.810613 -2.489638
H  1.580407 2.834631 -3.119409
H  -2.451564 4.842638 0.580458
H  -0.699811 4.821997 0.408758
H  -1.716112 4.634931 -1.018847
H  -5.159047 -3.16281 -0.747612
H  -6.166851 -2.804424 -2.151251
H  -6.839613 -2.672261 -0.521701
H  -1.714278 -2.887423 0.772155
elementType: S O N C H
totalener: -1760.73593837 hartree
nucrepener: 3026.77668680 hartree
electener: -4787.51262518 hartree
oneelecener: -8431.97126001 hartree
twoeener: 3644.45863484 hartree
cpcmener: -0.04423875 hartree
kineticenergy: 1754.38402283 hartree
xcener: -145.159265603383 hartree
chargesum: 0.0000000
charge: 0.881045 -0.492439 -0.508032 -0.267847 -0.421266 -0.280771 -0.455883 -0.201112 -0.137811 -0.443373 -0.440892 -0.401846 -0.165129 -0.135751 0.079703 -0.005490 -0.192744 -0.166358 -0.108709 0.442442 0.366230 0.368888 0.391354 0.411633 0.079743 -0.121887 -0.284118 -0.150224 0.144754 0.220891 0.147866 0.165502 0.165257 0.105012 0.061200 0.173375 0.111982 0.135747 0.121379 0.097477 0.091845 0.094063 0.111672 0.111601 0.111432 0.189590
qa: 0.8810 -0.4924 -0.5080 -0.2678 -0.4213 -0.2808 -0.4559 -0.2011 -0.1378 -0.4434 -0.4409 -0.4018 -0.1651 -0.1358 0.0797 -0.0055 -0.1927 -0.1664 -0.1087 0.4424 0.3662 0.3689 0.3914 0.4116 0.0797 -0.1219 -0.2841 -0.1502 0.1448 0.2209 0.1479 0.1655 0.1653 0.1050 0.0612 0.1734 0.1120 0.1357 0.1214 0.0975 0.0918 0.0941 0.1117 0.1116 0.1114 0.1896
va: 5.8199 2.0089 1.9799 2.1385 2.0727 2.1330 2.0653 3.0811 3.1885 2.9842 2.9262 2.9648 3.2200 3.7875 3.6871 3.8462 4.0286 3.9494 3.8978 4.0958 4.4197 4.2605 4.2243 4.3002 3.8001 3.8654 3.9870 3.8732 1.0238 1.0556 1.0079 0.9878 0.9867 0.9945 1.0001 1.0150 0.9900 0.9947 0.9939 1.0050 1.0042 1.0009 1.0182 0.9910 0.9907 1.0191
dispcorr: -0.025418874 hartree
energy: -1760.761357248463
dipole: -9.13068 8.29027 -0.84040 9.46424 -9.80364 -0.33939 -11.84151 8.88936 -2.95215
magnitude: 3.08814 au
magnitude: 7.84944 debye
