program: Orca
programVersion: 4.2.1
elementType: S O O O O O O N N N N N N C C C C C C C C C C C C C C C H H H H H H H H H H H H H H H H H H
charge: 0
multiplicity: 1
keywords: wb97x-d3
keywords: def2-TZVPP
keywords: def2/J RIJCOSX GRIDX6 NOFINALGRIDX
keywords: grid4 nofinalgrid
keywords: scfconv7
keywords: smallprint printgap noloewdin
keywords: NOSOSCF
formula: C15H18N6O6S
InChI: InChI=1S/C15H18N6O6S/c1-4-27-15-19-12(16-2)17-13(20-15)18-14(23)21-28(24,25)10-8-6-5-7-9(10)11(22)26-3/h5-8,16,18,21H,4H2,1-3H3
46 atoms
S  1.472451 -2.106369 0.115369
O  1.741439 -3.22174 -0.764449
O  1.087017 -2.346322 1.493702
O  2.441837 -0.052618 3.363086
O  0.930399 0.665827 1.877272
O  -4.764027 2.389991 -1.761253
O  1.116328 -0.90729 -2.570485
N  0.22406 -1.202109 -0.50109
N  -0.861257 0.075084 -2.105497
N  -2.055264 0.026714 -0.116876
N  -2.806955 1.242801 -1.985277
N  -4.076447 1.246459 0.003879
N  -3.316928 0.032942 1.786581
C  2.880238 -1.030188 0.1044
C  3.053247 -0.089811 1.120051
C  3.840228 -1.210033 -0.878687
C  4.214697 0.669141 1.134556
C  4.984728 -0.427246 -0.86247
C  5.17106 0.507719 0.141841
C  2.006712 0.200551 2.147535
C  0.22782 -0.703193 -1.773754
C  -1.947509 0.454053 -1.359149
C  -3.150383 0.446003 0.536894
C  -3.845198 1.604487 -1.242652
C  -4.617073 2.883258 -3.102165
C  1.552918 0.2227 4.449566
C  -3.675162 4.061002 -3.181406
C  -2.39449 -0.831029 2.482946
H  3.710594 -1.956016 -1.6492
H  -0.541734 -0.909324 0.127079
H  4.371504 1.401986 1.915095
H  5.731656 -0.55901 -1.63302
H  6.06651 1.114052 0.161068
H  -4.305858 2.078808 -3.769038
H  -5.62522 3.182189 -3.385557
H  -4.138487 0.360496 2.267636
H  2.0887 -0.06225 5.350179
H  1.298272 1.281097 4.497849
H  0.641235 -0.369423 4.371461
H  -3.986834 4.866017 -2.515113
H  -2.649306 3.784973 -2.940444
H  -3.683165 4.452165 -4.199728
H  -2.277729 -1.792268 1.98114
H  -2.792443 -1.017492 3.476445
H  -1.411813 -0.371756 2.590766
H  -0.840115 0.439362 -3.049268
elementType: S O N C H
totalener: -1760.73670154 hartree
nucrepener: 3002.33946787 hartree
electener: -4763.07616941 hartree
oneelecener: -8382.96979098 hartree
twoeener: 3619.89362157 hartree
cpcmener: -0.04537942 hartree
kineticenergy: 1754.38757952 hartree
xcener: -145.159717803590 hartree
chargesum: -0.0000000
charge: 0.878674 -0.491687 -0.508397 -0.266847 -0.422334 -0.289307 -0.457002 -0.203064 -0.138642 -0.440484 -0.450631 -0.399518 -0.176420 -0.128573 0.075141 -0.008955 -0.193090 -0.166444 -0.108147 0.442058 0.369009 0.374828 0.392079 0.425895 0.061361 -0.128212 -0.271544 -0.166911 0.145621 0.226263 0.146950 0.164671 0.164998 0.088754 0.113305 0.174365 0.135667 0.122467 0.116066 0.089575 0.091807 0.095195 0.111731 0.128319 0.090418 0.190992
qa: 0.8787 -0.4917 -0.5084 -0.2668 -0.4223 -0.2893 -0.4570 -0.2031 -0.1386 -0.4405 -0.4506 -0.3995 -0.1764 -0.1286 0.0751 -0.0090 -0.1931 -0.1664 -0.1081 0.4421 0.3690 0.3748 0.3921 0.4259 0.0614 -0.1282 -0.2715 -0.1669 0.1456 0.2263 0.1470 0.1647 0.1650 0.0888 0.1133 0.1744 0.1357 0.1225 0.1161 0.0896 0.0918 0.0952 0.1117 0.1283 0.0904 0.1910
va: 5.8211 2.0108 1.9795 2.1366 2.0748 2.1227 2.0640 3.0869 3.1940 2.9732 2.9205 2.9743 3.2263 3.7805 3.6975 3.8468 4.0290 3.9510 3.8998 4.1011 4.4171 4.2473 4.1943 4.3057 3.8204 3.8632 3.9251 3.8909 1.0240 1.0442 1.0074 0.9883 0.9868 1.0143 0.9932 1.0163 0.9943 0.9927 0.9896 1.0042 1.0103 1.0070 0.9949 0.9987 0.9999 1.0179
dispcorr: -0.025254107 hartree
energy: -1760.761955643590
dipole: -7.85314 8.00644 0.15331 15.20280 -12.79013 2.41267 3.82412 -2.54366 1.28046
magnitude: 2.73570 au
magnitude: 6.95359 debye
