program: Orca
programVersion: 4.2.1
elementType: S O O O O O O N N N N N N C C C C C C C C C C C C C C C H H H H H H H H H H H H H H H H H H
charge: 0
multiplicity: 1
keywords: wb97x-d3
keywords: def2-TZVPP
keywords: def2/J RIJCOSX GRIDX6 NOFINALGRIDX
keywords: grid4 nofinalgrid
keywords: scfconv7
keywords: smallprint printgap noloewdin
keywords: NOSOSCF
formula: C15H18N6O6S
InChI: InChI=1S/C15H18N6O6S/c1-4-27-15-19-12(16-2)17-13(20-15)18-14(23)21-28(24,25)10-8-6-5-7-9(10)11(22)26-3/h5-8,16,18,21H,4H2,1-3H3
46 atoms
S  2.103853 0.016844 -1.457401
O  2.212996 1.459334 -1.341797
O  2.504364 -0.64293 -2.679894
O  3.148003 2.220959 1.61354
O  1.133128 1.252666 1.505248
O  -5.609667 -0.399632 0.268601
O  0.630398 -2.551895 -1.325965
N  0.499748 -0.288958 -1.158115
N  -1.367359 -1.625754 -0.830756
N  -1.875542 0.619318 -0.535881
N  -3.499972 -1.064003 -0.284158
N  -4.094331 1.196245 0.040704
N  -2.486603 2.798805 -0.224014
C  2.979459 -0.721702 -0.105787
C  3.080684 -0.049439 1.111762
C  3.625374 -1.929911 -0.315301
C  3.8474 -0.611624 2.122105
C  4.368019 -2.490065 0.713009
C  4.478956 -1.831903 1.926524
C  2.331736 1.21054 1.407564
C  -0.022035 -1.552013 -1.125591
C  -2.273302 -0.637513 -0.541653
C  -2.828787 1.517112 -0.238331
C  -4.358691 -0.093609 0.001106
C  -6.029068 -1.773275 0.280889
C  2.559554 3.485603 1.931364
C  -5.676605 -2.469926 1.573536
C  -1.158426 3.286721 -0.506754
H  3.561072 -2.433934 -1.26853
H  -0.122823 0.494165 -0.900136
H  3.942163 -0.104833 3.073448
H  4.865215 -3.437364 0.55689
H  5.063425 -2.26361 2.727665
H  -7.109993 -1.720988 0.159038
H  -5.619483 -2.30123 -0.580577
H  -3.213429 3.459813 -0.003828
H  1.937203 3.844486 1.111732
H  1.967343 3.433739 2.844378
H  3.389617 4.170461 2.07718
H  -6.089321 -1.943933 2.435053
H  -6.104397 -3.473365 1.562322
H  -4.600149 -2.569847 1.707594
H  -0.423607 2.87604 0.18445
H  -1.164988 4.366749 -0.390652
H  -0.846561 3.058936 -1.526714
H  -1.737394 -2.567281 -0.80977
elementType: S O N C H
totalener: -1760.73650223 hartree
nucrepener: 3000.97618853 hartree
electener: -4761.71269077 hartree
oneelecener: -8380.20444648 hartree
twoeener: 3618.49175571 hartree
cpcmener: -0.04511836 hartree
kineticenergy: 1754.38804132 hartree
xcener: -145.159815461466 hartree
chargesum: 0.0000000
charge: 0.876427 -0.506945 -0.490259 -0.265727 -0.421170 -0.289469 -0.456634 -0.202900 -0.140092 -0.440596 -0.451108 -0.399222 -0.176033 -0.126996 0.075437 -0.011520 -0.190707 -0.166074 -0.109912 0.437152 0.370327 0.375101 0.392207 0.426759 0.062263 -0.126266 -0.273000 -0.165470 0.145046 0.225780 0.147554 0.165602 0.164881 0.113026 0.088514 0.174357 0.115818 0.120700 0.136180 0.089632 0.095629 0.092406 0.087092 0.127791 0.113613 0.190809
qa: 0.8764 -0.5069 -0.4903 -0.2657 -0.4212 -0.2895 -0.4566 -0.2029 -0.1401 -0.4406 -0.4511 -0.3992 -0.1760 -0.1270 0.0754 -0.0115 -0.1907 -0.1661 -0.1099 0.4372 0.3703 0.3751 0.3922 0.4268 0.0623 -0.1263 -0.2730 -0.1655 0.1450 0.2258 0.1476 0.1656 0.1649 0.1130 0.0885 0.1744 0.1158 0.1207 0.1362 0.0896 0.0956 0.0924 0.0871 0.1278 0.1136 0.1908
va: 5.8230 1.9805 2.0125 2.1360 2.0762 2.1228 2.0638 3.0849 3.1948 2.9749 2.9209 2.9734 3.2274 3.7789 3.7036 3.8509 4.0259 3.9477 3.8978 4.1076 4.4156 4.2473 4.1928 4.3048 3.8204 3.8612 3.9254 3.8916 1.0243 1.0457 1.0063 0.9879 0.9868 0.9930 1.0147 1.0162 0.9905 0.9939 0.9941 1.0044 1.0067 1.0100 1.0010 0.9988 0.9944 1.0181
dispcorr: -0.025288221 hartree
energy: -1760.761790453199
dipole: -11.57052 11.18005 -0.39047 3.07732 -2.46265 0.61467 12.48736 -9.92774 2.55962
magnitude: 2.66119 au
magnitude: 6.76421 debye
