program: Orca
programVersion: 4.2.1
elementType: S O O O O O O N N N N N N C C C C C C C C C C C C C C C H H H H H H H H H H H H H H H H H H
charge: 0
multiplicity: 1
keywords: wb97x-d3
keywords: def2-TZVPP
keywords: def2/J RIJCOSX GRIDX6 NOFINALGRIDX
keywords: grid4 nofinalgrid
keywords: scfconv7
keywords: smallprint printgap noloewdin
keywords: NOSOSCF
formula: C15H18N6O6S
InChI: InChI=1S/C15H18N6O6S/c1-4-27-15-19-12(16-2)17-13(20-15)18-14(23)21-28(24,25)10-8-6-5-7-9(10)11(22)26-3/h5-8,16,18,21H,4H2,1-3H3
46 atoms
S  1.53215 -1.982053 -0.133287
O  1.815403 -2.923671 -1.192874
O  1.089467 -2.459483 1.163728
O  2.395322 -0.678241 3.456051
O  0.985587 0.43708 2.121968
O  -4.719924 2.668818 -1.544088
O  1.286535 -0.323847 -2.574523
N  0.323305 -0.950144 -0.613989
N  -0.719038 0.55833 -2.035832
N  -1.980608 0.197972 -0.121593
N  -2.711351 1.631497 -1.838555
N  -4.050744 1.322293 0.078989
N  -3.301435 -0.078071 1.722191
C  2.956824 -0.955774 0.104042
C  3.106351 -0.231772 1.286463
C  3.947453 -0.961401 -0.865224
C  4.274725 0.489782 1.483521
C  5.099297 -0.216421 -0.662819
C  5.261918 0.505099 0.508146
C  2.027946 -0.131458 2.317562
C  0.36668 -0.255369 -1.790474
C  -1.844529 0.795123 -1.288952
C  -3.11148 0.492843 0.53982
C  -3.79198 1.849081 -1.100265
C  -4.581803 3.28239 -2.835171
C  1.459555 -0.634933 4.537173
C  -4.98624 2.35551 -3.956821
C  -2.369431 -0.988793 2.3421
H  3.834587 -1.542506 -1.768845
H  -0.466191 -0.766164 0.025859
H  4.412842 1.055096 2.395791
H  5.870659 -0.210994 -1.420425
H  6.163106 1.080486 0.671178
H  -5.248782 4.142217 -2.792264
H  -3.565492 3.652661 -2.971493
H  -4.155595 0.150536 2.203649
H  0.552924 -1.188788 4.292839
H  1.954963 -1.112674 5.377224
H  1.201578 0.389679 4.802764
H  -4.960306 2.906706 -4.897827
H  -4.311942 1.50508 -4.052393
H  -6.001904 1.983166 -3.819159
H  -2.242493 -1.903512 1.761638
H  -2.763906 -1.261726 3.31676
H  -1.392916 -0.528392 2.48794
H  -0.672894 1.060264 -2.913221
elementType: S O N C H
totalener: -1760.73637453 hartree
nucrepener: 2995.50715378 hartree
electener: -4756.24352831 hartree
oneelecener: -8369.27495860 hartree
twoeener: 3613.03143028 hartree
cpcmener: -0.04490486 hartree
kineticenergy: 1754.38811912 hartree
xcener: -145.159623112950 hartree
chargesum: -0.0000000
charge: 0.876704 -0.490008 -0.506908 -0.265865 -0.420184 -0.289407 -0.457143 -0.205184 -0.140085 -0.441494 -0.451174 -0.399828 -0.175769 -0.122200 0.072263 -0.010659 -0.190266 -0.166985 -0.108858 0.435935 0.371992 0.375565 0.391830 0.426905 0.061586 -0.125636 -0.274057 -0.169930 0.144409 0.227627 0.147705 0.164505 0.164800 0.113054 0.088974 0.174452 0.115605 0.135232 0.120883 0.095319 0.092874 0.090271 0.113178 0.128225 0.090950 0.190798
qa: 0.8767 -0.4900 -0.5069 -0.2659 -0.4202 -0.2894 -0.4571 -0.2052 -0.1401 -0.4415 -0.4512 -0.3998 -0.1758 -0.1222 0.0723 -0.0107 -0.1903 -0.1670 -0.1089 0.4359 0.3720 0.3756 0.3918 0.4269 0.0616 -0.1256 -0.2741 -0.1699 0.1444 0.2276 0.1477 0.1645 0.1648 0.1131 0.0890 0.1745 0.1156 0.1352 0.1209 0.0953 0.0929 0.0903 0.1132 0.1282 0.0909 0.1908
va: 5.8233 2.0133 1.9806 2.1354 2.0779 2.1231 2.0638 3.0874 3.1942 2.9746 2.9198 2.9732 3.2274 3.7769 3.7058 3.8504 4.0263 3.9488 3.8989 4.1086 4.4141 4.2461 4.1934 4.3039 3.8209 3.8606 3.9253 3.8898 1.0246 1.0426 1.0063 0.9884 0.9869 0.9931 1.0145 1.0163 0.9905 0.9947 0.9938 1.0070 1.0098 1.0043 0.9942 0.9985 1.0016 1.0181
dispcorr: -0.025234208 hartree
energy: -1760.761608736269
dipole: -11.23662 11.26551 0.02889 9.02561 -7.08583 1.93979 2.98018 -1.37775 1.60244
magnitude: 2.51623 au
magnitude: 6.39575 debye
