program: Orca
programVersion: 4.2.1
elementType: S O O O O O O N N N N N N C C C C C C C C C C C C C C C H H H H H H H H H H H H H H H H H H
charge: 0
multiplicity: 1
keywords: wb97x-d3
keywords: def2-TZVPP
keywords: def2/J RIJCOSX GRIDX6 NOFINALGRIDX
keywords: grid4 nofinalgrid
keywords: scfconv7
keywords: smallprint printgap noloewdin
keywords: NOSOSCF
formula: C15H18N6O6S
InChI: InChI=1S/C15H18N6O6S/c1-4-27-15-19-12(16-2)17-13(20-15)18-14(23)21-28(24,25)10-8-6-5-7-9(10)11(22)26-3/h5-8,16,18,21H,4H2,1-3H3
46 atoms
S  1.870209 -0.212447 -1.469452
O  1.901614 1.238592 -1.486748
O  2.22576 -0.958394 -2.655407
O  2.88201 2.292831 1.370598
O  0.95724 1.153607 1.433759
O  -2.849839 2.402735 -0.115117
O  0.574789 -2.829665 -0.97832
N  0.308915 -0.574071 -1.034845
N  -1.432256 -1.971478 -0.405226
N  -3.550403 -1.484702 0.240816
N  -2.064117 0.264059 -0.283472
N  -4.263145 0.772053 0.374866
N  -5.68265 -0.927034 0.890322
C  2.875854 -0.77738 -0.124147
C  2.988384 -0.00861 1.034171
C  3.6091 -1.941626 -0.287896
C  3.854747 -0.429001 2.032444
C  4.45615 -2.358575 0.72793
C  4.578258 -1.604082 1.882819
C  2.150263 1.204143 1.281909
C  -0.124517 -1.853469 -0.823315
C  -2.383193 -1.017216 -0.14056
C  -4.473224 -0.547455 0.494056
C  -3.055394 1.108907 -0.009759
C  -1.560823 2.910768 -0.494691
C  2.196314 3.524686 1.614134
C  -1.330972 2.866266 -1.986971
C  -6.127095 -2.282234 1.095062
H  3.533656 -2.519595 -1.197403
H  -0.332228 0.194121 -0.786252
H  3.958028 0.153612 2.938371
H  5.024973 -3.270108 0.607459
H  5.241899 -1.925445 2.674101
H  -1.57281 3.94318 -0.147869
H  -0.777051 2.390047 0.055513
H  -6.340011 -0.184334 1.069661
H  2.968265 4.284886 1.685765
H  1.527847 3.768844 0.788179
H  1.630438 3.492388 2.544284
H  -2.110788 3.409278 -2.521197
H  -0.379264 3.348314 -2.211944
H  -1.289127 1.851431 -2.38043
H  -5.323503 -2.977712 0.87658
H  -6.970356 -2.512333 0.443469
H  -6.441246 -2.430449 2.12851
H  -1.737732 -2.925768 -0.264015
elementType: S O N C H
totalener: -1760.73433115 hartree
nucrepener: 3042.55731624 hartree
electener: -4803.29164739 hartree
oneelecener: -8463.54818431 hartree
twoeener: 3660.25653692 hartree
cpcmener: -0.04405734 hartree
kineticenergy: 1754.38751629 hartree
xcener: -145.161494143617 hartree
chargesum: -0.0000000
charge: 0.877803 -0.506088 -0.490528 -0.264771 -0.422620 -0.291542 -0.456410 -0.200546 -0.138533 -0.445387 -0.449390 -0.400438 -0.165753 -0.120630 0.075538 -0.013062 -0.188201 -0.163921 -0.111230 0.435867 0.368164 0.372124 0.390539 0.419185 0.061642 -0.125035 -0.266515 -0.149423 0.145121 0.218525 0.148167 0.165556 0.165057 0.123842 0.054212 0.173503 0.136177 0.114734 0.121151 0.101992 0.096726 0.081080 0.111215 0.111407 0.111400 0.189295
qa: 0.8778 -0.5061 -0.4905 -0.2648 -0.4226 -0.2915 -0.4564 -0.2005 -0.1385 -0.4454 -0.4494 -0.4004 -0.1658 -0.1206 0.0755 -0.0131 -0.1882 -0.1639 -0.1112 0.4359 0.3682 0.3721 0.3905 0.4192 0.0616 -0.1250 -0.2665 -0.1494 0.1451 0.2185 0.1482 0.1656 0.1651 0.1238 0.0542 0.1735 0.1362 0.1147 0.1212 0.1020 0.0967 0.0811 0.1112 0.1114 0.1114 0.1893
va: 5.8135 1.9814 2.0111 2.1380 2.0717 2.1315 2.0648 3.0967 3.1884 2.9815 2.9125 2.9639 3.2202 3.7830 3.6977 3.8507 4.0243 3.9480 3.9008 4.1049 4.4180 4.2518 4.2283 4.2864 3.8434 3.8618 3.9086 3.8736 1.0237 1.0473 1.0062 0.9878 0.9869 0.9953 1.0224 1.0150 0.9943 0.9898 0.9942 1.0065 1.0105 1.0152 1.0183 0.9908 0.9910 1.0196
dispcorr: -0.026526979 hartree
energy: -1760.760858131972
dipole: -8.86197 7.98592 -0.87605 8.25489 -8.07840 0.17649 6.21186 -3.50963 2.70223
magnitude: 2.84617 au
magnitude: 7.23438 debye
