program: Orca
programVersion: 4.2.1
elementType: S O O O O O O N N N N N N C C C C C C C C C C C C C C C H H H H H H H H H H H H H H H H H H
charge: 0
multiplicity: 1
keywords: wb97x-d3
keywords: def2-TZVPP
keywords: def2/J RIJCOSX GRIDX6 NOFINALGRIDX
keywords: grid4 nofinalgrid
keywords: scfconv7
keywords: smallprint printgap noloewdin
keywords: NOSOSCF
formula: C15H18N6O6S
InChI: InChI=1S/C15H18N6O6S/c1-4-27-15-19-12(16-2)17-13(20-15)18-14(23)21-28(24,25)10-8-6-5-7-9(10)11(22)26-3/h5-8,16,18,21H,4H2,1-3H3
46 atoms
S  1.396546 -2.209565 0.087482
O  1.652653 -3.286473 -0.83432
O  0.939944 -2.472989 1.435897
O  2.447538 -0.099239 3.461374
O  0.929808 0.457911 1.916946
O  -4.44418 2.806038 -1.833753
O  1.258466 -0.788703 -2.542586
N  0.235743 -1.196307 -0.546545
N  -0.69503 0.251339 -2.108656
N  -2.008084 0.154767 -0.198262
N  -2.564337 1.53954 -2.019867
N  -3.94912 1.505234 -0.107088
N  -3.373704 0.148013 1.633672
C  2.866409 -1.206986 0.175795
C  3.075112 -0.318584 1.230485
C  3.846644 -1.424741 -0.778153
C  4.297233 0.335123 1.316833
C  5.050136 -0.742232 -0.692455
C  5.276226 0.131981 0.356226
C  2.011718 0.035745 2.218513
C  0.345956 -0.611014 -1.776963
C  -1.795232 0.653739 -1.400929
C  -3.106133 0.61687 0.414588
C  -3.621347 1.921942 -1.313505
C  -4.169112 3.329101 -3.133021
C  1.531944 0.232436 4.498065
C  -5.247434 4.337174 -3.451189
C  -2.543621 -0.801914 2.333597
H  3.670649 -2.125475 -1.580864
H  -0.527357 -0.888299 0.068804
H  4.483511 1.017949 2.134628
H  5.811519 -0.905445 -1.442668
H  6.218522 0.657508 0.43358
H  -3.18046 3.793367 -3.148675
H  -4.15802 2.520168 -3.867228
H  -4.203837 0.510555 2.067844
H  2.071043 0.087935 5.429807
H  1.196339 1.266902 4.425741
H  0.662116 -0.42397 4.476526
H  -6.235683 3.878623 -3.453691
H  -5.251626 5.157026 -2.733689
H  -5.070545 4.758241 -4.440647
H  -2.47072 -1.749794 1.799288
H  -2.992321 -0.99663 3.304308
H  -1.534601 -0.419984 2.48879
H  -0.595764 0.67998 -3.016694
totalener: -1760.70092048 hartree
nucrepener: 2980.06891719 hartree
electener: -4740.76983767 hartree
oneelecener: -8337.31373799 hartree
twoeener: 3596.54390031 hartree
kineticenergy: 1754.43027379 hartree
xcener: -145.156454877351 hartree
chargesum: -0.0000000
charge: 0.865269 -0.433759 -0.472078 -0.256183 -0.376582 -0.240692 -0.380469 -0.208596 -0.163397 -0.430368 -0.424608 -0.347507 -0.195072 -0.188099 0.096361 0.036040 -0.185052 -0.141883 -0.094551 0.408181 0.342545 0.362463 0.397369 0.378881 0.033068 -0.139115 -0.233969 -0.167765 0.137944 0.221303 0.120644 0.134333 0.133414 0.086067 0.086882 0.146430 0.124734 0.112641 0.113030 0.086642 0.085969 0.078251 0.115265 0.101273 0.107262 0.167484
qa: 0.8653 -0.4338 -0.4721 -0.2562 -0.3766 -0.2407 -0.3805 -0.2086 -0.1634 -0.4304 -0.4246 -0.3475 -0.1951 -0.1881 0.0964 0.0360 -0.1851 -0.1419 -0.0946 0.4082 0.3425 0.3625 0.3974 0.3789 0.0331 -0.1391 -0.2340 -0.1678 0.1379 0.2213 0.1206 0.1343 0.1334 0.0861 0.0869 0.1464 0.1247 0.1126 0.1130 0.0866 0.0860 0.0783 0.1153 0.1013 0.1073 0.1675
va: 5.8410 2.0776 2.0200 2.1360 2.1166 2.1571 2.1396 3.1045 3.1722 2.9746 2.9492 2.9919 3.1974 3.9328 3.6793 3.8646 4.0704 3.9750 3.9441 4.1233 4.4143 4.2547 4.1576 4.3442 3.8595 3.8938 3.9597 3.9079 1.0287 1.0407 1.0198 0.9990 0.9980 0.9993 0.9985 1.0364 0.9954 0.9936 0.9917 1.0057 1.0058 1.0068 0.9955 1.0005 0.9979 1.0366
dispcorr: -0.024443528 hartree
energy: -1760.725364007607
dipole: -11.34210 11.39399 0.05188 15.65829 -13.89827 1.76002 3.40607 -2.39676 1.00932
magnitude: 2.02955 au
magnitude: 5.15872 debye
