program: Orca
programVersion: 4.2.1
elementType: S O O O O O O N N N N N N C C C C C C C C C C C C C C C H H H H H H H H H H H H H H H H H H
charge: 0
multiplicity: 1
keywords: wb97x-d3
keywords: def2-TZVPP
keywords: def2/J RIJCOSX GRIDX6 NOFINALGRIDX
keywords: grid4 nofinalgrid
keywords: scfconv7
keywords: smallprint printgap noloewdin
keywords: NOSOSCF
formula: C15H18N6O6S
InChI: InChI=1S/C15H18N6O6S/c1-4-27-15-19-12(16-2)17-13(20-15)18-14(23)21-28(24,25)10-8-6-5-7-9(10)11(22)26-3/h5-8,16,18,21H,4H2,1-3H3
46 atoms
S  1.361481 -2.256693 0.098311
O  1.62131 -3.341681 -0.812751
O  0.893752 -2.507712 1.445254
O  2.393088 -0.090111 3.455402
O  0.886581 0.430531 1.888029
O  -4.356791 2.888634 -1.833843
O  1.256439 -0.843693 -2.536627
N  0.208677 -1.244883 -0.552421
N  -0.683562 0.226355 -2.115181
N  -2.014373 0.143645 -0.21656
N  -2.51489 1.567991 -2.023607
N  -3.914082 1.551262 -0.121064
N  -3.392587 0.154969 1.605797
C  2.835054 -1.258856 0.189297
C  3.038021 -0.357893 1.234534
C  3.823871 -1.49401 -0.751605
C  4.262905 0.290413 1.32459
C  5.030167 -0.817068 -0.662682
C  5.250449 0.0696 0.376668
C  1.966756 0.016504 2.206441
C  0.339522 -0.655385 -1.778824
C  -1.777012 0.652084 -1.410558
C  -3.102416 0.630827 0.394576
C  -3.564829 1.973432 -1.31952
C  -4.054611 3.422324 -3.122722
C  1.470112 0.26771 4.476878
C  -5.096076 4.470901 -3.432236
C  -2.596815 -0.829174 2.298052
H  3.652097 -2.203887 -1.547049
H  -0.554663 -0.926284 0.057154
H  4.444626 0.9831 2.135099
H  5.798051 -0.99383 -1.403152
H  6.194665 0.591211 0.45671
H  -3.051058 3.853574 -3.124118
H  -4.064736 2.625075 -3.869536
H  -4.214934 0.536271 2.038649
H  1.138525 1.301529 4.378109
H  0.598043 -0.386308 4.463567
H  2.001683 0.142703 5.4157
H  -6.099097 4.046133 -3.449016
H  -5.078047 5.278871 -2.701662
H  -4.897521 4.901415 -4.413476
H  -3.05636 -1.021593 3.264141
H  -1.577121 -0.481114 2.462865
H  -2.551066 -1.772206 1.752237
H  -0.566701 0.660709 -3.018381
totalener: -1760.70084946 hartree
nucrepener: 2982.68736209 hartree
electener: -4743.38821155 hartree
oneelecener: -8342.55459494 hartree
twoeener: 3599.16638339 hartree
kineticenergy: 1754.43154559 hartree
xcener: -145.156620957212 hartree
chargesum: 0.0000000
charge: 0.866228 -0.433991 -0.472127 -0.256680 -0.377088 -0.240784 -0.380213 -0.208482 -0.163681 -0.429702 -0.424539 -0.347625 -0.194763 -0.189368 0.095835 0.036424 -0.185200 -0.141622 -0.094274 0.409400 0.342008 0.362149 0.397630 0.379136 0.032922 -0.138799 -0.233950 -0.166710 0.137860 0.220896 0.120715 0.134315 0.133419 0.086178 0.086852 0.146313 0.112640 0.112901 0.124742 0.086711 0.085897 0.078285 0.101283 0.105846 0.115680 0.167332
qa: 0.8662 -0.4340 -0.4721 -0.2567 -0.3771 -0.2408 -0.3802 -0.2085 -0.1637 -0.4297 -0.4245 -0.3476 -0.1948 -0.1894 0.0958 0.0364 -0.1852 -0.1416 -0.0943 0.4094 0.3420 0.3621 0.3976 0.3791 0.0329 -0.1388 -0.2339 -0.1667 0.1379 0.2209 0.1207 0.1343 0.1334 0.0862 0.0869 0.1463 0.1126 0.1129 0.1247 0.0867 0.0859 0.0783 0.1013 0.1058 0.1157 0.1673
va: 5.8410 2.0770 2.0202 2.1360 2.1154 2.1569 2.1398 3.1043 3.1722 2.9746 2.9493 2.9923 3.1970 3.9358 3.6777 3.8640 4.0703 3.9750 3.9438 4.1211 4.4148 4.2553 4.1579 4.3439 3.8596 3.8943 3.9596 3.9085 1.0288 1.0417 1.0201 0.9990 0.9980 0.9993 0.9985 1.0365 0.9937 0.9915 0.9953 1.0057 1.0058 1.0068 1.0005 0.9974 0.9954 1.0367
dispcorr: -0.024482521 hartree
energy: -1760.725331979907
dipole: -11.06434 11.12750 0.06317 16.11339 -14.32252 1.79087 3.37911 -2.37411 1.00500
magnitude: 2.05456 au
magnitude: 5.22228 debye
