program: Orca
programVersion: 4.2.1
elementType: S O O O O O O N N N N N N C C C C C C C C C C C C C C C H H H H H H H H H H H H H H H H H H
charge: 0
multiplicity: 1
keywords: wb97x-d3
keywords: def2-TZVPP
keywords: def2/J RIJCOSX GRIDX6 NOFINALGRIDX
keywords: grid4 nofinalgrid
keywords: scfconv7
keywords: smallprint printgap noloewdin
keywords: NOSOSCF
formula: C15H18N6O6S
InChI: InChI=1S/C15H18N6O6S/c1-4-27-15-19-12(16-2)17-13(20-15)18-14(23)21-28(24,25)10-8-6-5-7-9(10)11(22)26-3/h5-8,16,18,21H,4H2,1-3H3
46 atoms
S  1.516513 -2.079115 0.015139
O  1.78432 -3.098119 -0.966838
O  1.079507 -2.424655 1.351563
O  2.567247 -0.298718 3.509764
O  1.040167 0.457864 2.060744
O  -4.74002 2.443553 -1.84824
O  1.283394 -0.578878 -2.56417
N  0.327847 -1.057866 -0.550856
N  -0.729205 0.322388 -2.094861
N  -1.999248 0.143793 -0.160666
N  -2.726105 1.400223 -2.015753
N  -4.077622 1.274003 -0.083957
N  -3.334067 0.054435 1.693118
C  2.9638 -1.051399 0.146344
C  3.171292 -0.243335 1.263044
C  3.927175 -1.165281 -0.842462
C  4.375559 0.437906 1.376787
C  5.112096 -0.455396 -0.727474
C  5.337162 0.340233 0.382555
C  2.120427 -0.006532 2.299275
C  0.37495 -0.464462 -1.781944
C  -1.857837 0.623556 -1.381766
C  -3.134633 0.50347 0.453885
C  -3.813129 1.683056 -1.308191
C  -4.546485 2.936549 -3.173808
C  1.65847 -0.112549 4.588095
C  -5.75647 3.767451 -3.528007
C  -2.395792 -0.768565 2.416746
H  3.752878 -1.806494 -1.69379
H  -0.439185 -0.803367 0.08314
H  4.560994 1.058385 2.243231
H  5.861017 -0.536187 -1.503162
H  6.265975 0.885605 0.482047
H  -3.632674 3.533217 -3.221624
H  -4.425079 2.102905 -3.86925
H  -4.194618 0.339688 2.125749
H  2.198127 -0.401083 5.485356
H  1.337486 0.925951 4.671347
H  0.779893 -0.747432 4.472654
H  -5.874958 4.610926 -2.848751
H  -5.642368 4.16282 -4.537103
H  -6.670209 3.174849 -3.50138
H  -1.431402 -0.27493 2.534513
H  -2.229719 -1.727416 1.924215
H  -2.806277 -0.964288 3.404099
H  -0.683672 0.741327 -3.011678
totalener: -1760.70115553 hartree
nucrepener: 2971.14506848 hartree
electener: -4731.84622401 hartree
oneelecener: -8319.43496962 hartree
twoeener: 3587.58874560 hartree
kineticenergy: 1754.43075713 hartree
xcener: -145.156513822232 hartree
chargesum: 0.0000000
charge: 0.864168 -0.431898 -0.472889 -0.253885 -0.375199 -0.240654 -0.380955 -0.210511 -0.163459 -0.432941 -0.424907 -0.348265 -0.194698 -0.182581 0.098099 0.032339 -0.184544 -0.144062 -0.094041 0.404114 0.345339 0.363296 0.396573 0.379021 0.033076 -0.139583 -0.234980 -0.173019 0.138483 0.222660 0.120172 0.134220 0.133247 0.086110 0.087322 0.146864 0.125105 0.112355 0.112624 0.086718 0.078320 0.086522 0.112836 0.114659 0.100704 0.168122
qa: 0.8642 -0.4319 -0.4729 -0.2539 -0.3752 -0.2407 -0.3810 -0.2105 -0.1635 -0.4329 -0.4249 -0.3483 -0.1947 -0.1826 0.0981 0.0323 -0.1845 -0.1441 -0.0940 0.4041 0.3453 0.3633 0.3966 0.3790 0.0331 -0.1396 -0.2350 -0.1730 0.1385 0.2227 0.1202 0.1342 0.1332 0.0861 0.0873 0.1469 0.1251 0.1124 0.1126 0.0867 0.0783 0.0865 0.1128 0.1147 0.1007 0.1681
va: 5.8421 2.0812 2.0183 2.1368 2.1209 2.1576 2.1386 3.1064 3.1716 2.9741 2.9490 2.9908 3.1977 3.9246 3.6903 3.8710 4.0688 3.9752 3.9422 4.1295 4.4112 4.2528 4.1583 4.3443 3.8593 3.8939 3.9596 3.9050 1.0284 1.0371 1.0185 0.9991 0.9980 0.9990 0.9988 1.0363 0.9957 0.9930 0.9923 1.0056 1.0069 1.0058 1.0002 0.9952 1.0005 1.0363
dispcorr: -0.024324221 hartree
energy: -1760.725479755813
dipole: -12.45395 12.43648 -0.01747 13.65845 -12.04997 1.60848 3.63858 -2.57664 1.06194
magnitude: 1.92750 au
magnitude: 4.89931 debye
