program: Orca
programVersion: 4.2.1
elementType: S O O O O O O N N N N N N C C C C C C C C C C C C C C C H H H H H H H H H H H H H H H H H H
charge: 0
multiplicity: 1
keywords: wb97x-d3
keywords: def2-TZVPP
keywords: def2/J RIJCOSX GRIDX6 NOFINALGRIDX
keywords: grid4 nofinalgrid
keywords: scfconv7
keywords: smallprint printgap noloewdin
keywords: NOSOSCF
formula: C15H18N6O6S
InChI: InChI=1S/C15H18N6O6S/c1-4-27-15-19-12(16-2)17-13(20-15)18-14(23)21-28(24,25)10-8-6-5-7-9(10)11(22)26-3/h5-8,16,18,21H,4H2,1-3H3
46 atoms
S  1.773104 -0.0187 1.567092
O  2.069948 -0.591961 2.854635
O  1.786206 1.415401 1.364987
O  3.051439 1.9943 -1.739648
O  1.090116 0.948113 -1.494048
O  -2.920671 2.314557 -0.255662
O  0.511303 -2.727977 1.345522
N  0.246021 -0.47909 1.088353
N  -1.489159 -1.959299 0.641532
N  -3.611982 -1.589698 -0.074033
N  -2.142849 0.228276 0.212928
N  -4.339261 0.626586 -0.52771
N  -5.740302 -1.147957 -0.782969
C  2.865809 -0.763428 0.374835
C  3.097376 -0.162699 -0.86175
C  3.568295 -1.89199 0.76368
C  4.064874 -0.707436 -1.695263
C  4.509921 -2.440369 -0.092977
C  4.7616 -1.845123 -1.31695
C  2.283156 0.982325 -1.370618
C  -0.172767 -1.780213 1.055881
C  -2.446243 -1.063039 0.24698
C  -4.528659 -0.693828 -0.452193
C  -3.134047 1.02182 -0.188023
C  -1.625454 2.82851 0.074476
C  2.388846 3.143372 -2.25434
C  -1.676809 4.327054 -0.098412
C  -6.105138 -2.540616 -0.788053
H  3.382827 -2.335624 1.73066
H  -0.382774 0.241234 0.714067
H  4.269554 -0.247218 -2.652509
H  5.052227 -3.326797 0.205825
H  5.505595 -2.262413 -1.98209
H  -1.368785 2.567844 1.104283
H  -0.870843 2.385858 -0.578214
H  -6.397797 -0.453165 -1.089688
H  1.796722 2.907015 -3.138616
H  1.738363 3.589675 -1.501625
H  3.173523 3.846885 -2.517205
H  -2.418872 4.782021 0.556673
H  -0.704336 4.749713 0.153557
H  -1.910115 4.603607 -1.126158
H  -5.57477 -3.101569 -1.558522
H  -7.171824 -2.61636 -0.980999
H  -5.89638 -3.008178 0.172523
H  -1.784696 -2.924099 0.629287
totalener: -1760.70072983 hartree
nucrepener: 3008.90730420 hartree
electener: -4769.60803403 hartree
oneelecener: -8394.97568050 hartree
twoeener: 3625.36764647 hartree
kineticenergy: 1754.43043445 hartree
xcener: -145.156906836695 hartree
chargesum: -0.0000000
charge: 0.865800 -0.432472 -0.474318 -0.255086 -0.377375 -0.242136 -0.380079 -0.207474 -0.163156 -0.419138 -0.438825 -0.344838 -0.201848 -0.183357 0.099268 0.033247 -0.185602 -0.144298 -0.093264 0.405393 0.342939 0.362281 0.394180 0.382495 0.048134 -0.133336 -0.264531 -0.145989 0.137492 0.217862 0.121486 0.135082 0.133000 0.090997 0.082145 0.149791 0.112474 0.108452 0.124963 0.092368 0.082452 0.086829 0.108784 0.095519 0.106647 0.167041
qa: 0.8658 -0.4325 -0.4743 -0.2551 -0.3774 -0.2421 -0.3801 -0.2075 -0.1632 -0.4191 -0.4388 -0.3448 -0.2018 -0.1834 0.0993 0.0332 -0.1856 -0.1443 -0.0933 0.4054 0.3429 0.3623 0.3942 0.3825 0.0481 -0.1333 -0.2645 -0.1460 0.1375 0.2179 0.1215 0.1351 0.1330 0.0910 0.0821 0.1498 0.1125 0.1085 0.1250 0.0924 0.0825 0.0868 0.1088 0.0955 0.1066 0.1670
va: 5.8393 2.0800 2.0157 2.1380 2.1175 2.1716 2.1404 3.1031 3.1714 2.9784 2.9380 2.9929 3.1800 3.9281 3.6879 3.8720 4.0698 3.9758 3.9416 4.1258 4.4144 4.2551 4.1967 4.3193 3.8311 3.8957 3.9834 3.9122 1.0287 1.0464 1.0186 0.9988 0.9980 0.9968 1.0057 1.0345 0.9939 0.9929 0.9954 1.0073 1.0052 1.0039 0.9941 0.9987 0.9998 1.0370
dispcorr: -0.024904015 hartree
energy: -1760.725633846020
dipole: -8.69074 8.13413 -0.55661 9.54965 -9.63995 -0.09030 -11.13760 9.14785 -1.98976
magnitude: 2.06811 au
magnitude: 5.25673 debye
