program: Orca
programVersion: 4.2.1
elementType: S O O O O O O N N N N N N C C C C C C C C C C C C C C C H H H H H H H H H H H H H H H H H H
charge: 0
multiplicity: 1
keywords: wb97x-d3
keywords: def2-TZVPP
keywords: def2/J RIJCOSX GRIDX6 NOFINALGRIDX
keywords: grid4 nofinalgrid
keywords: scfconv7
keywords: smallprint printgap noloewdin
keywords: NOSOSCF
formula: C15H18N6O6S
InChI: InChI=1S/C15H18N6O6S/c1-4-27-15-19-12(16-2)17-13(20-15)18-14(23)21-28(24,25)10-8-6-5-7-9(10)11(22)26-3/h5-8,16,18,21H,4H2,1-3H3
46 atoms
S  1.776586 -0.06598 1.631848
O  2.074298 -0.68885 2.895502
O  1.791432 1.374822 1.482979
O  3.075542 2.112681 -1.493491
O  1.106159 1.054324 -1.410927
O  -2.892217 2.325409 -0.222804
O  0.507035 -2.760934 1.323136
N  0.247419 -0.504309 1.135012
N  -1.477466 -1.968981 0.602906
N  -3.567444 -1.583493 -0.191706
N  -2.120858 0.229808 0.216556
N  -4.28292 0.63936 -0.614488
N  -5.668052 -1.114326 -1.002133
C  2.859482 -0.766573 0.406067
C  3.088516 -0.111159 -0.802221
C  3.545315 -1.92489 0.732814
C  4.034638 -0.632541 -1.673808
C  4.466317 -2.447989 -0.161157
C  4.713463 -1.799974 -1.35928
C  2.293962 1.076115 -1.242091
C  -0.170518 -1.803493 1.050389
C  -2.420221 -1.063005 0.195413
C  -4.471664 -0.683463 -0.589598
C  -3.097955 1.029936 -0.205343
C  -1.61832 2.838357 0.182582
C  2.4318 3.309535 -1.91515
C  -1.670583 4.340197 0.040415
C  -6.095723 -2.485809 -1.065532
H  3.362348 -2.411478 1.679459
H  -0.375936 0.228412 0.775522
H  4.236411 -0.129869 -2.610238
H  4.995556 -3.3575 0.087436
H  5.440347 -2.199348 -2.053691
H  -1.412275 2.555184 1.217851
H  -0.829643 2.415305 -0.441834
H  -6.302822 -0.38826 -1.287631
H  1.872365 3.16388 -2.839503
H  1.754632 3.680738 -1.145238
H  3.225462 4.033015 -2.077989
H  -1.853851 4.637806 -0.991629
H  -2.447144 4.777305 0.667102
H  -0.71443 4.762381 0.349482
H  -6.956976 -2.65989 -0.418749
H  -5.285623 -3.129398 -0.73854
H  -6.367493 -2.76433 -2.084725
H  -1.769449 -2.933349 0.549366
totalener: -1760.70033881 hartree
nucrepener: 3011.56351424 hartree
electener: -4772.26385305 hartree
oneelecener: -8400.25234701 hartree
twoeener: 3627.98849397 hartree
kineticenergy: 1754.42900608 hartree
xcener: -145.158227802834 hartree
chargesum: 0.0000000
charge: 0.865627 -0.430620 -0.474283 -0.252416 -0.375765 -0.242190 -0.380628 -0.209160 -0.165270 -0.422780 -0.439486 -0.348413 -0.187113 -0.184896 0.105975 0.031904 -0.184258 -0.144396 -0.094034 0.398986 0.343894 0.368064 0.386884 0.381241 0.048723 -0.133616 -0.265725 -0.152423 0.137464 0.217122 0.120349 0.134796 0.132696 0.091857 0.082150 0.148398 0.112546 0.107520 0.125601 0.087604 0.092809 0.081331 0.102607 0.112817 0.101872 0.166633
qa: 0.8656 -0.4306 -0.4743 -0.2524 -0.3758 -0.2422 -0.3806 -0.2092 -0.1653 -0.4228 -0.4395 -0.3484 -0.1871 -0.1849 0.1060 0.0319 -0.1843 -0.1444 -0.0940 0.3990 0.3439 0.3681 0.3869 0.3812 0.0487 -0.1336 -0.2657 -0.1524 0.1375 0.2171 0.1203 0.1348 0.1327 0.0919 0.0822 0.1484 0.1125 0.1075 0.1256 0.0876 0.0928 0.0813 0.1026 0.1128 0.1019 0.1666
va: 5.8386 2.0822 2.0156 2.1391 2.1187 2.1719 2.1388 3.1020 3.1756 2.9883 2.9396 2.9823 3.1839 3.9252 3.6885 3.8732 4.0689 3.9751 3.9405 4.1330 4.4119 4.2397 4.2015 4.3219 3.8278 3.8962 3.9842 3.8815 1.0285 1.0481 1.0174 0.9989 0.9980 0.9963 1.0060 1.0333 0.9935 0.9935 0.9955 1.0036 1.0075 1.0054 0.9903 1.0231 0.9907 1.0373
dispcorr: -0.025012059 hartree
energy: -1760.725350864466
dipole: -8.76156 8.21374 -0.54782 10.12241 -10.13683 -0.01441 -10.96516 8.98331 -1.98184
magnitude: 2.05622 au
magnitude: 5.22649 debye
