program: Orca
programVersion: 4.2.1
elementType: S O O O O O O N N N N N N C C C C C C C C C C C C C C C H H H H H H H H H H H H H H H H H H
charge: 0
multiplicity: 1
keywords: wb97x-d3
keywords: def2-TZVPP
keywords: def2/J RIJCOSX GRIDX6 NOFINALGRIDX
keywords: grid4 nofinalgrid
keywords: scfconv7
keywords: smallprint printgap noloewdin
keywords: NOSOSCF
formula: C15H18N6O6S
InChI: InChI=1S/C15H18N6O6S/c1-4-27-15-19-12(16-2)17-13(20-15)18-14(23)21-28(24,25)10-8-6-5-7-9(10)11(22)26-3/h5-8,16,18,21H,4H2,1-3H3
46 atoms
S  1.521627 -1.994668 -0.157904
O  1.819904 -2.894992 -1.241707
O  1.075423 -2.491812 1.126589
O  2.507885 -0.592079 3.525974
O  0.9766 0.288243 2.153262
O  -4.76303 2.658924 -1.566064
O  1.290703 -0.22998 -2.563944
N  0.321492 -0.937193 -0.62534
N  -0.736064 0.593468 -2.020203
N  -2.021372 0.191648 -0.130277
N  -2.742481 1.641089 -1.840942
N  -4.106719 1.296631 0.053384
N  -3.37412 -0.114091 1.6871
C  2.947512 -0.962049 0.103637
C  3.128512 -0.2793 1.305389
C  3.921985 -0.946641 -0.880872
C  4.317899 0.40765 1.507625
C  5.091131 -0.231343 -0.674551
C  5.290171 0.439714 0.519566
C  2.064323 -0.178235 2.350324
C  0.373871 -0.211776 -1.783376
C  -1.873252 0.806099 -1.288856
C  -3.164434 0.473973 0.509503
C  -3.837204 1.840703 -1.115568
C  -4.595255 3.287536 -2.836798
C  1.588659 -0.54145 4.610201
C  -4.973227 2.37555 -3.984049
C  -2.443461 -1.017726 2.318554
H  3.768344 -1.49219 -1.800108
H  -0.454349 -0.759692 0.024362
H  4.483095 0.931223 2.43965
H  5.848199 -0.210608 -1.44624
H  6.206846 0.988258 0.689384
H  -5.26145 4.148787 -2.79857
H  -3.57364 3.65262 -2.949917
H  -4.241669 0.114646 2.138976
H  0.727562 -1.183023 4.42263
H  2.130646 -0.907881 5.477105
H  1.240451 0.474353 4.797942
H  -4.937914 2.934902 -4.919546
H  -4.286777 1.535138 -4.07191
H  -5.985531 1.990055 -3.864989
H  -2.272736 -1.912077 1.718119
H  -2.864433 -1.327707 3.271632
H  -1.480386 -0.542937 2.504255
H  -0.684856 1.112665 -2.883823
totalener: -1760.70022104 hartree
nucrepener: 2985.87679851 hartree
electener: -4746.57701955 hartree
oneelecener: -8348.88253077 hartree
twoeener: 3602.30551122 hartree
kineticenergy: 1754.43258997 hartree
xcener: -145.158236420623 hartree
chargesum: 0.0000000
charge: 0.864220 -0.431538 -0.472549 -0.253872 -0.375752 -0.248661 -0.381060 -0.212223 -0.166759 -0.434001 -0.437600 -0.345443 -0.193155 -0.182158 0.098288 0.032847 -0.185861 -0.144567 -0.093165 0.404775 0.345936 0.367744 0.394475 0.388487 0.045609 -0.140245 -0.269606 -0.172824 0.137691 0.223945 0.120248 0.134220 0.133237 0.103636 0.083022 0.147054 0.113174 0.125166 0.112622 0.082411 0.096063 0.090706 0.114669 0.100807 0.112390 0.167596
qa: 0.8642 -0.4315 -0.4725 -0.2539 -0.3758 -0.2487 -0.3811 -0.2122 -0.1668 -0.4340 -0.4376 -0.3454 -0.1932 -0.1822 0.0983 0.0328 -0.1859 -0.1446 -0.0932 0.4048 0.3459 0.3677 0.3945 0.3885 0.0456 -0.1402 -0.2696 -0.1728 0.1377 0.2239 0.1202 0.1342 0.1332 0.1036 0.0830 0.1471 0.1132 0.1252 0.1126 0.0824 0.0961 0.0907 0.1147 0.1008 0.1124 0.1676
va: 5.8431 2.0814 2.0188 2.1366 2.1202 2.1626 2.1385 3.1064 3.1783 2.9761 2.9286 2.9910 3.1978 3.9229 3.6926 3.8699 4.0699 3.9761 3.9414 4.1289 4.4100 4.2362 4.1609 4.3308 3.8494 3.8932 3.9252 3.9053 1.0290 1.0364 1.0187 0.9992 0.9980 0.9925 1.0155 1.0362 0.9922 0.9957 0.9931 1.0104 1.0104 1.0046 0.9953 1.0004 1.0001 1.0364
dispcorr: -0.024820095 hartree
energy: -1760.725041133681
dipole: -11.00567 10.98534 -0.02034 9.22380 -7.81333 1.41046 3.07298 -1.88716 1.18582
magnitude: 1.84282 au
magnitude: 4.68408 debye
