program: Orca
programVersion: 4.2.1
elementType: S O O O O O O N N N N N N C C C C C C C C C C C C C C C H H H H H H H H H H H H H H H H H H
charge: 0
multiplicity: 1
keywords: wb97x-d3
keywords: def2-TZVPP
keywords: def2/J RIJCOSX GRIDX6 NOFINALGRIDX
keywords: grid4 nofinalgrid
keywords: scfconv7
keywords: smallprint printgap noloewdin
keywords: NOSOSCF
formula: C15H18N6O6S
InChI: InChI=1S/C15H18N6O6S/c1-4-27-15-19-12(16-2)17-13(20-15)18-14(23)21-28(24,25)10-8-6-5-7-9(10)11(22)26-3/h5-8,16,18,21H,4H2,1-3H3
46 atoms
S  1.848554 -0.19013 -1.471813
O  1.867816 1.258182 -1.490358
O  2.202561 -0.95326 -2.641004
O  2.968396 2.282084 1.587485
O  1.008222 1.231305 1.356988
O  -2.921813 2.398425 -0.228913
O  0.56751 -2.829163 -0.866282
N  0.295121 -0.570459 -1.006765
N  -1.444082 -1.957922 -0.336177
N  -3.572719 -1.482522 0.288531
N  -2.112226 0.26732 -0.305177
N  -4.319637 0.769609 0.328982
N  -5.716024 -0.921858 0.905579
C  2.869232 -0.749029 -0.124393
C  3.033434 0.02392 1.024406
C  3.581135 -1.923656 -0.30297
C  3.941802 -0.398548 1.985679
C  4.46283 -2.345619 0.679826
C  4.646072 -1.581411 1.819051
C  2.207303 1.235699 1.31182
C  -0.122629 -1.84835 -0.756023
C  -2.408457 -1.011141 -0.110508
C  -4.500566 -0.543742 0.497222
C  -3.115449 1.110993 -0.068024
C  -1.643213 2.88674 -0.650242
C  2.294784 3.497972 1.892391
C  -1.425016 2.748528 -2.141615
C  -6.136163 -2.272137 1.166774
H  3.448189 -2.502241 -1.205029
H  -0.341361 0.197878 -0.76475
H  4.092901 0.194358 2.877639
H  5.011607 -3.267507 0.54543
H  5.342089 -1.900983 2.582918
H  -1.661807 3.93948 -0.369815
H  -0.844841 2.409209 -0.080741
H  -6.366342 -0.168396 1.050324
H  1.702562 3.839822 1.043442
H  1.642504 3.392305 2.759367
H  3.073601 4.22404 2.10659
H  -2.200966 3.268091 -2.702994
H  -0.462686 3.186759 -2.404901
H  -1.405119 1.708622 -2.462968
H  -6.397756 -2.408723 2.217401
H  -5.326689 -2.952745 0.92392
H  -7.0024 -2.535015 0.558386
H  -1.736057 -2.907381 -0.158974
totalener: -1760.69899859 hartree
nucrepener: 3031.68802611 hartree
electener: -4792.38702470 hartree
oneelecener: -8440.56876578 hartree
twoeener: 3648.18174108 hartree
kineticenergy: 1754.43009231 hartree
xcener: -145.160290715259 hartree
chargesum: -0.0000000
charge: 0.865843 -0.476903 -0.432727 -0.255016 -0.376810 -0.251346 -0.380545 -0.208530 -0.165596 -0.423353 -0.446483 -0.346816 -0.187508 -0.179863 0.095235 0.035090 -0.185142 -0.142120 -0.093978 0.408320 0.342987 0.366708 0.385533 0.390855 0.036654 -0.136285 -0.267354 -0.152674 0.137145 0.214954 0.120905 0.135106 0.133128 0.104332 0.075796 0.148473 0.112739 0.112775 0.124386 0.097827 0.097412 0.082881 0.102003 0.113034 0.102126 0.166802
qa: 0.8658 -0.4769 -0.4327 -0.2550 -0.3768 -0.2513 -0.3805 -0.2085 -0.1656 -0.4234 -0.4465 -0.3468 -0.1875 -0.1799 0.0952 0.0351 -0.1851 -0.1421 -0.0940 0.4083 0.3430 0.3667 0.3855 0.3909 0.0367 -0.1363 -0.2674 -0.1527 0.1371 0.2150 0.1209 0.1351 0.1331 0.1043 0.0758 0.1485 0.1127 0.1128 0.1244 0.0978 0.0974 0.0829 0.1020 0.1130 0.1021 0.1668
va: 5.8287 2.0135 2.0780 2.1377 2.1141 2.1740 2.1396 3.1115 3.1749 2.9880 2.9224 2.9821 3.1836 3.9308 3.6899 3.8644 4.0690 3.9753 3.9431 4.1220 4.4128 4.2351 4.2048 4.3051 3.8742 3.8938 3.9125 3.8819 1.0290 1.0440 1.0190 0.9988 0.9980 0.9949 1.0140 1.0334 0.9925 0.9939 0.9948 1.0048 1.0132 1.0178 0.9902 1.0230 0.9911 1.0373
dispcorr: -0.026000910 hartree
energy: -1760.724999499660
dipole: -8.78121 8.19676 -0.58445 7.80160 -7.64067 0.16093 6.29158 -4.34718 1.94440
magnitude: 2.03670 au
magnitude: 5.17689 debye
