program: Orca
programVersion: 5.0.2
elementType: S F F F O O O O O O N N N N N N C C C C C C C C C C C C C C C C C H H H H H H H H H H H H H H H H H H H
charge: 0
multiplicity: 1
keywords: wb97x-d3
keywords: def2-TZVPP
keywords: def2/J RIJCOSX
keywords: DEFGRID2
keywords: scfconv7
keywords: smallprint printgap noloewdin
keywords: NOSOSCF
formula: C17H19F3N6O6S
InChI: InChI=1S/C17H19F3N6O6S/c1-9-6-5-7-10(12(27)31-4)11(9)33(29,30)25-15(28)22-13-21-14(26(2)3)24-16(23-13)32-8-17(18,19)20/h5-7,22,25H,8H2,1-4H3
52 atoms
S  2.155368 -2.578788 -0.743555
F  -6.056209 4.159606 0.330624
F  -3.916409 3.892519 0.27133
F  -4.908556 4.160342 2.15566
O  1.957223 -2.413632 -2.170875
O  2.041769 -3.900331 -0.162944
O  2.238772 1.169183 0.569637
O  2.383419 0.672164 -1.60979
O  1.60729 -1.989807 2.107416
O  -4.139718 1.480789 1.696722
N  1.010419 -1.589665 -0.048591
N  -0.301604 -0.848481 1.724429
N  -2.197017 0.323735 -2.296784
N  -1.250906 -0.311797 -0.319097
N  -2.230596 0.360597 1.71513
N  -3.245993 0.942229 -0.334505
C  3.708616 -1.847482 -0.26027
C  4.832544 -2.664974 -0.092429
C  3.779261 -0.46486 -0.062468
C  6.00611 -2.048414 0.344111
C  4.955553 0.102961 0.40034
C  4.882637 -4.139653 -0.372161
C  6.068045 -0.694959 0.610185
C  2.703904 0.494877 -0.46035
C  0.827677 -1.516793 1.30831
C  -1.295402 -0.242076 0.996154
C  -2.23966 0.323792 -0.970075
C  -3.176863 0.916179 0.970182
C  -1.09512 -0.323237 -2.98764
C  -3.211731 0.953388 -3.116947
C  1.299698 2.219599 0.306032
C  -5.246518 2.090022 1.061606
C  -5.022825 3.583205 0.953887
H  6.889711 -2.658976 0.477439
H  5.012403 1.17014 0.568499
H  4.424047 -4.721634 0.425956
H  5.922311 -4.452041 -0.44626
H  4.396706 -4.410718 -1.307687
H  6.990189 -0.253422 0.962481
H  -0.395403 -0.774945 2.730048
H  -0.136586 0.108325 -2.701756
H  -1.224266 -0.171923 -4.055591
H  -1.071963 -1.396307 -2.798926
H  -2.758238 1.711996 -3.754853
H  -3.967547 1.427366 -2.502045
H  -3.695571 0.212921 -3.754131
H  1.774573 3.030892 -0.244533
H  0.437086 1.857553 -0.251105
H  0.978633 2.579924 1.278279
H  -5.445122 1.674132 0.074557
H  -6.113507 1.907792 1.69695
H  0.277785 -1.174171 -0.651877
elementType: S F O N C H
totalener: -2137.14592241 hartree
nucrepener: 3972.32308615 hartree
electener: -6109.46900856 hartree
twoeener: 4730.06316752 hartree
cpcmener: -0.06436667 hartree
kineticenergy: 2129.53288176 hartree
xcener: -175.398219991069 hartree
chargesum: -0.0000000
charge: 0.875915 -0.180470 -0.179964 -0.183295 -0.514546 -0.502446 -0.274565 -0.442641 -0.471612 -0.287611 -0.236967 -0.117175 -0.102606 -0.444979 -0.419340 -0.447019 -0.279989 0.135477 0.176788 -0.175914 -0.238055 -0.219818 -0.090502 0.494475 0.376630 0.364337 0.388390 0.440566 -0.161268 -0.177001 -0.128854 -0.002276 0.478184 0.144628 0.150146 0.111051 0.097455 0.106609 0.165776 0.192378 0.103992 0.115693 0.110728 0.116640 0.115909 0.119135 0.143000 0.104984 0.135074 0.128033 0.151420 0.235500
qa: 0.8759 -0.1805 -0.1800 -0.1833 -0.5145 -0.5024 -0.2746 -0.4426 -0.4716 -0.2876 -0.2370 -0.1172 -0.1026 -0.4450 -0.4193 -0.4470 -0.2800 0.1355 0.1768 -0.1759 -0.2381 -0.2198 -0.0905 0.4945 0.3766 0.3643 0.3884 0.4406 -0.1613 -0.1770 -0.1289 -0.0023 0.4782 0.1446 0.1501 0.1111 0.0975 0.1066 0.1658 0.1924 0.1040 0.1157 0.1107 0.1166 0.1159 0.1191 0.1430 0.1050 0.1351 0.1280 0.1514 0.2355
va: 5.7697 1.1244 1.1164 1.1170 1.9562 1.9864 2.1210 2.0537 2.0436 2.1145 3.0779 3.2010 3.2515 2.9473 2.9563 2.9367 3.7479 3.6345 3.4411 3.9508 4.0683 3.8802 3.8787 3.9910 4.4032 4.2443 4.1193 4.2652 3.8701 3.8810 3.8417 3.8635 4.4245 0.9986 1.0076 1.0005 1.0031 1.0088 0.9866 1.0182 1.0015 1.0016 0.9974 0.9872 1.0124 0.9873 0.9937 0.9960 0.9941 1.0167 1.0022 1.0440
dispcorr: -0.033007426 hartree
energy: -2137.178929834723
dipole: 25.47065 -26.37710 -0.90644 -15.70526 17.65386 1.94860 -16.22885 15.44883 -0.78003
magnitude: 2.28629 au
magnitude: 5.81128 debye
