program: Orca
programVersion: 5.0.2
elementType: S F F F O O O O O O N N N N N N C C C C C C C C C C C C C C C C C H H H H H H H H H H H H H H H H H H H
charge: 0
multiplicity: 1
keywords: wb97x-d3
keywords: def2-TZVPP
keywords: def2/J RIJCOSX
keywords: DEFGRID2
keywords: scfconv7
keywords: smallprint printgap noloewdin
keywords: NOSOSCF
formula: C17H19F3N6O6S
InChI: InChI=1S/C17H19F3N6O6S/c1-9-6-5-7-10(12(27)31-4)11(9)33(29,30)25-15(28)22-13-21-14(26(2)3)24-16(23-13)32-8-17(18,19)20/h5-7,22,25H,8H2,1-4H3
52 atoms
S  1.959109 -2.764615 -0.194709
F  -4.512305 4.983878 3.136543
F  -5.935298 3.738489 2.098144
F  -4.668916 5.073334 0.987825
O  1.753005 -2.893067 -1.628281
O  1.841487 -3.943037 0.633275
O  2.107755 0.085667 -1.774061
O  3.514965 -0.843883 -3.241747
O  1.599123 -1.176727 2.325784
O  -3.912065 2.452961 0.768281
N  0.803436 -1.650234 0.251356
N  -0.230743 -0.07533 1.602759
N  -2.731057 -0.747553 -2.201325
N  -1.436491 -0.410052 -0.350505
N  -2.068373 1.209802 1.232414
N  -3.370259 0.895086 -0.710685
C  3.533359 -1.973742 0.066008
C  4.369412 -2.322537 1.137533
C  3.950821 -1.064952 -0.916064
C  5.614497 -1.693203 1.195687
C  5.206601 -0.486002 -0.82897
C  4.075032 -3.331881 2.209083
C  6.032252 -0.791179 0.238871
C  3.154621 -0.638697 -2.112903
C  0.783391 -0.99938 1.447752
C  -1.279577 0.241535 0.780968
C  -2.520582 -0.071381 -1.075922
C  -3.077272 1.483931 0.424431
C  -1.85996 -1.851008 -2.56444
C  -3.854815 -0.473878 -3.073267
C  1.320217 0.633381 -2.834281
C  -3.643299 3.174274 1.955243
C  -4.701255 4.247168 2.037189
H  6.274527 -1.935337 2.018467
H  5.533781 0.211813 -1.588597
H  4.849385 -3.273103 2.97174
H  4.085534 -4.347455 1.815258
H  3.118377 -3.173399 2.697174
H  7.007372 -0.329251 0.317765
H  -0.197942 0.435568 2.476527
H  -1.840744 -2.622582 -1.794583
H  -0.838069 -1.520482 -2.751578
H  -2.238117 -2.300069 -3.479067
H  -4.363501 0.434988 -2.771705
H  -4.57107 -1.29725 -3.05217
H  -3.504318 -0.349656 -4.097942
H  0.887839 -0.148352 -3.45782
H  0.527957 1.199961 -2.354764
H  1.912192 1.305062 -3.456285
H  -3.704361 2.537714 2.84063
H  -2.657243 3.644047 1.932434
H  0.066033 -1.423982 -0.434627
elementType: S F O N C H
totalener: -2137.15412703 hartree
nucrepener: 3884.98501064 hartree
electener: -6022.13913767 hartree
twoeener: 4641.60499653 hartree
cpcmener: -0.05028971 hartree
kineticenergy: 2129.56021084 hartree
xcener: -175.399606499913 hartree
chargesum: 0.0000000
charge: 0.879599 -0.178502 -0.178771 -0.178816 -0.517894 -0.489011 -0.254875 -0.431005 -0.472241 -0.270673 -0.193095 -0.137952 -0.100368 -0.450334 -0.455170 -0.421834 -0.303325 0.186236 0.145705 -0.159361 -0.228634 -0.211185 -0.091526 0.437291 0.382667 0.381185 0.399501 0.426071 -0.160029 -0.180555 -0.153746 -0.012247 0.487776 0.138922 0.147983 0.092208 0.109968 0.109509 0.162152 0.191047 0.114729 0.097845 0.114566 0.116763 0.117916 0.113653 0.125155 0.127596 0.139465 0.131027 0.129328 0.225288
qa: 0.8796 -0.1785 -0.1788 -0.1788 -0.5179 -0.4890 -0.2549 -0.4310 -0.4722 -0.2707 -0.1931 -0.1380 -0.1004 -0.4503 -0.4552 -0.4218 -0.3033 0.1862 0.1457 -0.1594 -0.2286 -0.2112 -0.0915 0.4373 0.3827 0.3812 0.3995 0.4261 -0.1600 -0.1806 -0.1537 -0.0122 0.4878 0.1389 0.1480 0.0922 0.1100 0.1095 0.1622 0.1910 0.1147 0.0978 0.1146 0.1168 0.1179 0.1137 0.1252 0.1276 0.1395 0.1310 0.1293 0.2253
va: 5.7882 1.1271 1.1230 1.1230 1.9622 2.0094 2.1168 2.0731 2.0473 2.1180 3.0992 3.1901 3.2295 2.9528 2.9353 2.9731 3.8538 3.5588 3.6470 3.9358 4.0462 3.8705 3.8899 4.1175 4.3865 4.2488 4.0940 4.2846 3.8893 3.8705 3.8494 3.8652 4.4604 1.0012 1.0067 1.0034 1.0010 1.0151 0.9881 1.0181 0.9972 0.9826 1.0016 1.0215 0.9870 0.9878 0.9834 0.9937 0.9983 1.0067 1.0080 1.0366
dispcorr: -0.030831311 hartree
energy: -2137.184958339123
dipole: 24.46534 -24.57612 -0.11078 -24.25433 25.73811 1.48377 -18.06908 18.07484 0.00575
magnitude: 1.48791 au
magnitude: 3.78198 debye
