program: Orca
programVersion: 5.0.2
elementType: S F F F O O O O O O N N N N N N C C C C C C C C C C C C C C C C C H H H H H H H H H H H H H H H H H H H
charge: 0
multiplicity: 1
keywords: wb97x-d3
keywords: def2-TZVPP
keywords: def2/J RIJCOSX
keywords: DEFGRID2
keywords: scfconv7
keywords: smallprint printgap noloewdin
keywords: NOSOSCF
formula: C17H19F3N6O6S
InChI: InChI=1S/C17H19F3N6O6S/c1-9-6-5-7-10(12(27)31-4)11(9)33(29,30)25-15(28)22-13-21-14(26(2)3)24-16(23-13)32-8-17(18,19)20/h5-7,22,25H,8H2,1-4H3
52 atoms
S  1.985837 -2.286509 1.050642
F  -3.616017 5.93076 1.012875
F  -3.62229 3.960132 1.897477
F  -5.335807 4.645785 0.802246
O  1.373073 -3.469816 0.480827
O  2.211483 -2.226558 2.478953
O  1.578023 -2.007035 -2.113297
O  1.933616 0.200292 -2.174656
O  2.218447 0.62967 1.520613
O  -3.836072 2.802322 -0.664403
N  0.970905 -1.039205 0.612957
N  0.144987 1.1255 0.778849
N  -3.176645 -1.65074 -0.846118
N  -1.49162 -0.316309 -0.022268
N  -1.832968 2.009645 0.104149
N  -3.538488 0.61603 -0.729334
C  3.508094 -1.895291 0.202366
C  4.726025 -2.25364 0.792275
C  3.466547 -1.204192 -1.014789
C  5.892404 -1.836347 0.148443
C  4.648279 -0.77842 -1.600407
C  4.883202 -3.066839 2.045772
C  5.862494 -1.091695 -1.013124
C  2.228995 -0.905687 -1.800317
C  1.183791 0.253803 1.020175
C  -1.107502 0.909411 0.263551
C  -2.737087 -0.434814 -0.523916
C  -3.02714 1.779715 -0.408708
C  -2.419258 -2.851999 -0.56132
C  -4.53364 -1.872814 -1.302656
C  0.40081 -1.871719 -2.914336
C  -3.401685 4.130554 -0.457013
C  -3.999031 4.663444 0.825484
H  6.845915 -2.1032 0.586121
H  4.619971 -0.223514 -2.528789
H  5.900428 -3.451929 2.092097
H  4.212453 -3.923277 2.088865
H  4.72044 -2.468836 2.941603
H  6.785818 -0.766596 -1.47372
H  0.350644 2.090184 1.009084
H  -2.634613 -3.592405 -1.330105
H  -2.695209 -3.27551 0.407535
H  -1.349893 -2.673719 -0.566669
H  -4.521412 -2.565242 -2.144266
H  -4.993788 -0.945392 -1.623472
H  -5.144788 -2.30964 -0.509376
H  -0.004637 -2.87389 -3.019245
H  -0.335127 -1.227047 -2.435773
H  0.642291 -1.475081 -3.900636
H  -2.315863 4.217196 -0.422168
H  -3.772296 4.723389 -1.2945
H  0.027374 -1.278197 0.269272
elementType: S F O N C H
totalener: -2137.15114542 hartree
nucrepener: 3949.52797146 hartree
electener: -6086.67911688 hartree
twoeener: 4707.13391703 hartree
cpcmener: -0.05226137 hartree
kineticenergy: 2129.55172755 hartree
xcener: -175.398636659533 hartree
chargesum: 0.0000000
charge: 0.872435 -0.179390 -0.178493 -0.181129 -0.504647 -0.490252 -0.252363 -0.433439 -0.440823 -0.281074 -0.240374 -0.133174 -0.106805 -0.454332 -0.452515 -0.418394 -0.289456 0.134816 0.186776 -0.160234 -0.226635 -0.222069 -0.101134 0.460609 0.366191 0.382205 0.405480 0.429088 -0.157131 -0.169689 -0.137787 -0.004879 0.476242 0.141433 0.145455 0.094659 0.106647 0.112311 0.162074 0.191842 0.116653 0.127995 0.081262 0.109867 0.118899 0.114468 0.135708 0.103248 0.139315 0.125188 0.147375 0.227975
qa: 0.8724 -0.1794 -0.1785 -0.1811 -0.5046 -0.4903 -0.2524 -0.4334 -0.4408 -0.2811 -0.2404 -0.1332 -0.1068 -0.4543 -0.4525 -0.4184 -0.2895 0.1348 0.1868 -0.1602 -0.2266 -0.2221 -0.1011 0.4606 0.3662 0.3822 0.4055 0.4291 -0.1571 -0.1697 -0.1378 -0.0049 0.4762 0.1414 0.1455 0.0947 0.1066 0.1123 0.1621 0.1918 0.1167 0.1280 0.0813 0.1099 0.1189 0.1145 0.1357 0.1032 0.1393 0.1252 0.1474 0.2280
va: 5.7791 1.1262 1.1199 1.1198 1.9642 2.0053 2.1436 2.0602 2.0819 2.1229 3.0821 3.2027 3.2497 2.9597 2.9237 2.9682 3.8001 3.6543 3.4461 3.9452 4.0562 3.8831 3.9003 4.0430 4.4112 4.2447 4.0767 4.2791 3.8940 3.8624 3.8462 3.8573 4.4347 0.9991 1.0112 1.0026 1.0092 1.0006 0.9885 1.0170 0.9940 0.9941 0.9976 0.9944 1.0215 0.9900 0.9918 0.9955 0.9966 1.0267 1.0016 1.0441
dispcorr: -0.032011230 hartree
energy: -2137.183156647865
dipole: 18.15775 -18.42308 -0.26532 -36.82280 35.87471 -0.94809 -14.83391 12.17886 -2.65506
magnitude: 2.83171 au
magnitude: 7.19764 debye
