program: Orca
programVersion: 5.0.2
elementType: S F F F O O O O O O N N N N N N C C C C C C C C C C C C C C C C C H H H H H H H H H H H H H H H H H H H
charge: 0
multiplicity: 1
keywords: wb97x-d3
keywords: def2-TZVPP
keywords: def2/J RIJCOSX
keywords: DEFGRID2
keywords: scfconv7
keywords: smallprint printgap noloewdin
keywords: NOSOSCF
formula: C17H19F3N6O6S
InChI: InChI=1S/C17H19F3N6O6S/c1-9-6-5-7-10(12(27)31-4)11(9)33(29,30)25-15(28)22-13-21-14(26(2)3)24-16(23-13)32-8-17(18,19)20/h5-7,22,25H,8H2,1-4H3
52 atoms
S  2.430472 -1.078132 1.687774
F  -3.718104 4.63242 -0.612215
F  -2.825507 2.930079 -1.594574
F  -1.61032 4.235029 -0.39585
O  2.622447 -2.15331 2.633043
O  2.393126 0.292385 2.16642
O  1.768705 1.084488 -0.672446
O  3.492056 2.310529 0.05389
O  1.235898 -3.396829 0.240934
O  -2.192966 1.773955 0.863708
N  0.94676 -1.259132 0.949702
N  -0.781153 -2.443657 -0.057491
N  -5.093628 -1.264344 -0.957812
N  -2.921441 -1.86775 -0.518425
N  -1.473744 -0.281365 0.452234
N  -3.687993 0.318067 -0.061786
C  3.650042 -1.15847 0.389758
C  4.486592 -2.272213 0.219557
C  3.811447 -0.003713 -0.390256
C  5.44158 -2.19322 -0.796936
C  4.792659 0.037532 -1.36664
C  4.491552 -3.522299 1.052076
C  5.595852 -1.068933 -1.58121
C  3.008418 1.256817 -0.265383
C  0.526729 -2.423925 0.377841
C  -1.760868 -1.484503 -0.033342
C  -3.884654 -0.937643 -0.506435
C  -2.491775 0.56862 0.389611
C  -5.425709 -2.601591 -1.399071
C  -6.194995 -0.327014 -0.985061
C  0.899869 2.221185 -0.652717
C  -3.128418 2.827835 0.756138
C  -2.815605 3.657217 -0.472218
H  6.091245 -3.043414 -0.958995
H  4.922935 0.929958 -1.964858
H  3.51919 -4.001216 1.113779
H  4.831163 -3.322926 2.067689
H  5.185682 -4.237026 0.613976
H  6.353908 -1.045979 -2.352775
H  -1.064223 -3.326658 -0.464153
H  -5.723983 -2.588043 -2.448862
H  -6.26222 -2.987254 -0.813454
H  -4.583164 -3.273379 -1.284005
H  -5.85198 0.690362 -0.8358
H  -6.926051 -0.568143 -0.210141
H  -6.694459 -0.386138 -1.95258
H  -0.019031 1.892152 -1.125364
H  0.705108 2.539333 0.370548
H  1.317583 3.051032 -1.222719
H  -4.157223 2.471049 0.709077
H  -3.013677 3.44855 1.645212
H  0.293976 -0.463656 0.979458
elementType: S F O N C H
totalener: -2137.15371537 hartree
nucrepener: 3964.33573447 hartree
electener: -6101.48944984 hartree
twoeener: 4722.42035340 hartree
cpcmener: -0.04918856 hartree
kineticenergy: 2129.55181692 hartree
xcener: -175.398759093169 hartree
chargesum: -0.0000000
charge: 0.877876 -0.177816 -0.183137 -0.181270 -0.487063 -0.512277 -0.258293 -0.431353 -0.476902 -0.284841 -0.196369 -0.137181 -0.100347 -0.457879 -0.429073 -0.443888 -0.283821 0.165093 0.134146 -0.156271 -0.221551 -0.209819 -0.095552 0.434493 0.390942 0.397161 0.392384 0.425695 -0.169480 -0.168654 -0.145182 -0.017888 0.495855 0.139531 0.147671 0.112321 0.108551 0.091389 0.161776 0.190461 0.112103 0.110524 0.118201 0.117468 0.114783 0.109013 0.120699 0.127850 0.131805 0.131593 0.150098 0.216422
qa: 0.8779 -0.1778 -0.1831 -0.1813 -0.4871 -0.5123 -0.2583 -0.4314 -0.4769 -0.2848 -0.1964 -0.1372 -0.1003 -0.4579 -0.4291 -0.4439 -0.2838 0.1651 0.1341 -0.1563 -0.2216 -0.2098 -0.0956 0.4345 0.3909 0.3972 0.3924 0.4257 -0.1695 -0.1687 -0.1452 -0.0179 0.4959 0.1395 0.1477 0.1123 0.1086 0.0914 0.1618 0.1905 0.1121 0.1105 0.1182 0.1175 0.1148 0.1090 0.1207 0.1279 0.1318 0.1316 0.1501 0.2164
va: 5.8052 1.1308 1.1119 1.1164 2.0160 1.9681 2.1182 2.0743 2.0390 2.1266 3.0897 3.1848 3.2545 2.9786 2.9364 2.9518 3.8431 3.6044 3.6623 3.9293 4.0397 3.8707 3.8904 4.1262 4.3812 4.2128 4.1545 4.2169 3.8644 3.8758 3.8403 3.8747 4.3858 1.0012 1.0065 1.0138 1.0021 1.0043 0.9885 1.0192 0.9918 0.9900 1.0227 1.0111 0.9907 0.9923 1.0026 0.9970 0.9995 1.0166 1.0030 1.0557
dispcorr: -0.030893073 hartree
energy: -2137.184608442441
dipole: -3.17346 -1.02649 -4.19996 -23.95506 23.26182 -0.69324 -5.65529 3.15203 -2.50326
magnitude: 4.93827 au
magnitude: 12.55209 debye
