program: Orca
programVersion: 5.0.2
elementType: S F F F O O O O O O N N N N N N C C C C C C C C C C C C C C C C C H H H H H H H H H H H H H H H H H H H
charge: 0
multiplicity: 1
keywords: wb97x-d3
keywords: def2-TZVPP
keywords: def2/J RIJCOSX
keywords: DEFGRID2
keywords: scfconv7
keywords: smallprint printgap noloewdin
keywords: NOSOSCF
formula: C17H19F3N6O6S
InChI: InChI=1S/C17H19F3N6O6S/c1-9-6-5-7-10(12(27)31-4)11(9)33(29,30)25-15(28)22-13-21-14(26(2)3)24-16(23-13)32-8-17(18,19)20/h5-7,22,25H,8H2,1-4H3
52 atoms
S  1.936666 -2.656714 0.462568
F  -5.538062 4.69354 -0.906223
F  -3.720131 4.884934 -2.056986
F  -3.684755 3.876937 -0.163495
O  1.980215 -3.929171 -0.221623
O  1.442513 -2.61424 1.829459
O  1.790376 0.358766 1.659687
O  2.831666 -0.351298 3.506363
O  2.102258 -1.395652 -2.251719
O  -3.577598 2.170248 -2.472121
N  0.900798 -1.627362 -0.338863
N  0.139676 -0.300089 -2.081516
N  -3.054307 -0.485542 1.23047
N  -1.427732 -0.396452 -0.372514
N  -1.754413 0.934852 -2.287662
N  -3.393837 0.885353 -0.593911
C  3.541019 -1.879933 0.438308
C  4.578306 -2.342394 -0.385851
C  3.757429 -0.860354 1.375983
C  5.818213 -1.714386 -0.248825
C  5.012809 -0.2867 1.49374
C  4.497624 -3.466212 -1.378114
C  6.040508 -0.70746 0.668026
C  2.728938 -0.297859 2.309396
C  1.116392 -1.143444 -1.593734
C  -1.06076 0.08532 -1.544362
C  -2.628515 0.01023 0.073024
C  -2.898495 1.299668 -1.73174
C  -2.297628 -1.529804 1.897161
C  -4.326456 -0.108018 1.811095
C  0.784121 1.009029 2.43839
C  -4.756766 2.764414 -1.97164
C  -4.416465 4.060915 -1.267403
H  6.633158 -2.042466 -0.88109
H  5.183957 0.495638 2.221399
H  5.410292 -3.483018 -1.971253
H  3.660835 -3.37342 -2.063463
H  4.417917 -4.432647 -0.881806
H  7.01913 -0.253116 0.747366
H  0.344271 0.088388 -2.994157
H  -2.167079 -2.404879 1.260137
H  -2.846254 -1.838783 2.782843
H  -1.315179 -1.181537 2.216027
H  -5.078081 -0.884495 1.654347
H  -4.689461 0.818428 1.379204
H  -4.203211 0.03922 2.883198
H  0.113658 1.479133 1.72547
H  0.230387 0.298351 3.050957
H  1.217887 1.776485 3.079838
H  -5.382935 2.987503 -2.835889
H  -5.310112 2.107507 -1.299939
H  0.034834 -1.343978 0.146132
elementType: S F O N C H
totalener: -2137.15254460 hartree
nucrepener: 3937.96426179 hartree
electener: -6075.11680639 hartree
twoeener: 4695.11016992 hartree
cpcmener: -0.05067780 hartree
kineticenergy: 2129.55869527 hartree
xcener: -175.399138107658 hartree
chargesum: 0.0000000
charge: 0.878856 -0.179396 -0.180644 -0.178721 -0.489047 -0.518738 -0.254312 -0.431537 -0.474185 -0.277751 -0.193845 -0.133754 -0.108800 -0.454794 -0.417995 -0.449480 -0.300638 0.182723 0.145162 -0.158438 -0.228346 -0.211502 -0.092162 0.437436 0.383999 0.392111 0.385205 0.425111 -0.155955 -0.174960 -0.155021 -0.009137 0.479775 0.138977 0.148545 0.091287 0.110870 0.109407 0.162200 0.189860 0.116300 0.114043 0.096224 0.120255 0.112585 0.112758 0.128177 0.125036 0.140270 0.148307 0.126964 0.226716
qa: 0.8789 -0.1794 -0.1806 -0.1787 -0.4890 -0.5187 -0.2543 -0.4315 -0.4742 -0.2778 -0.1938 -0.1338 -0.1088 -0.4548 -0.4180 -0.4495 -0.3006 0.1827 0.1452 -0.1584 -0.2283 -0.2115 -0.0922 0.4374 0.3840 0.3921 0.3852 0.4251 -0.1560 -0.1750 -0.1550 -0.0091 0.4798 0.1390 0.1485 0.0913 0.1109 0.1094 0.1622 0.1899 0.1163 0.1140 0.0962 0.1203 0.1126 0.1128 0.1282 0.1250 0.1403 0.1483 0.1270 0.2267
va: 5.7882 1.1266 1.1207 1.1167 2.0097 1.9599 2.1176 2.0729 2.0453 2.1208 3.0981 3.1871 3.2418 2.9515 2.9604 2.9392 3.8550 3.5629 3.6479 3.9357 4.0454 3.8710 3.8927 4.1185 4.3866 4.2310 4.1294 4.2908 3.8861 3.8816 3.8499 3.8794 4.4201 1.0013 1.0066 1.0037 1.0152 1.0012 0.9881 1.0203 0.9974 1.0021 0.9829 0.9873 1.0104 0.9902 0.9942 0.9831 0.9980 1.0025 1.0173 1.0350
dispcorr: -0.031712996 hartree
energy: -2137.184257595717
dipole: 15.35444 -17.42216 -2.06772 -22.68835 23.98387 1.29551 13.55577 -13.42489 0.13087
magnitude: 2.44355 au
magnitude: 6.21101 debye
