program: Orca
programVersion: 5.0.2
elementType: S F F F O O O O O O N N N N N N C C C C C C C C C C C C C C C C C H H H H H H H H H H H H H H H H H H H
charge: 0
multiplicity: 1
keywords: wb97x-d3
keywords: def2-TZVPP
keywords: def2/J RIJCOSX
keywords: DEFGRID2
keywords: scfconv7
keywords: smallprint printgap noloewdin
keywords: NOSOSCF
formula: C17H19F3N6O6S
InChI: InChI=1S/C17H19F3N6O6S/c1-9-6-5-7-10(12(27)31-4)11(9)33(29,30)25-15(28)22-13-21-14(26(2)3)24-16(23-13)32-8-17(18,19)20/h5-7,22,25H,8H2,1-4H3
52 atoms
S  2.271808 -2.345922 -0.888439
F  -6.656872 2.251548 2.115741
F  -5.321299 3.917736 2.354441
F  -5.743167 2.628622 4.031247
O  2.328568 -1.891074 -2.26776
O  2.233295 -3.764676 -0.618678
O  3.877022 0.725627 -2.522039
O  2.075295 0.984036 -1.220732
O  1.164068 -2.210398 1.873348
O  -4.205963 1.821078 0.967134
N  0.883953 -1.632375 -0.305621
N  -0.611011 -0.934449 1.327101
N  -1.94242 0.667986 -2.776952
N  -1.246133 -0.14443 -0.759246
N  -2.422137 0.431398 1.195165
N  -3.12435 1.280244 -0.890943
C  3.610388 -1.564587 -0.010768
C  4.354048 -2.232132 0.972324
C  3.944365 -0.267155 -0.423093
C  5.415412 -1.526085 1.543729
C  5.019179 0.384833 0.156711
C  4.143569 -3.642854 1.442332
C  5.746676 -0.245289 1.152052
C  3.168399 0.52529 -1.431892
C  0.529832 -1.642442 1.011052
C  -1.448752 -0.190429 0.538712
C  -2.116132 0.608691 -1.460154
C  -3.208773 1.147328 0.411272
C  -0.852239 -0.054284 -3.406231
C  -2.817404 1.42494 -3.646537
C  3.279417 1.498169 -3.56749
C  -4.354783 1.75767 2.372933
C  -5.528001 2.64648 2.711551
H  6.001636 -2.011665 2.312998
H  5.283928 1.384835 -0.160813
H  3.127525 -3.832443 1.776597
H  4.810812 -3.841435 2.27871
H  4.378685 -4.365285 0.661765
H  6.581656 0.263281 1.614742
H  -0.837762 -0.935867 2.314159
H  0.113451 0.238213 -2.99793
H  -0.849999 0.184304 -4.466463
H  -0.964853 -1.134073 -3.303853
H  -3.267371 0.767206 -4.391482
H  -2.25359 2.199629 -4.168415
H  -3.610407 1.897214 -3.078216
H  2.372258 1.021155 -3.939588
H  3.051706 2.511062 -3.236037
H  4.016754 1.537754 -4.364436
H  -4.562144 0.740817 2.714112
H  -3.466308 2.123397 2.892667
H  0.30285 -1.083289 -0.95764
elementType: S F O N C H
totalener: -2137.15611001 hartree
nucrepener: 3871.37671777 hartree
electener: -6008.53282778 hartree
twoeener: 4629.68359939 hartree
cpcmener: -0.04626895 hartree
kineticenergy: 2129.54478381 hartree
xcener: -175.397372968439 hartree
chargesum: 0.0000000
charge: 0.874241 -0.178893 -0.179074 -0.178912 -0.515249 -0.486124 -0.265748 -0.431358 -0.472916 -0.271367 -0.203326 -0.137449 -0.105135 -0.448232 -0.454789 -0.420792 -0.277169 0.160466 0.152602 -0.159007 -0.218305 -0.203411 -0.097453 0.432622 0.382780 0.375935 0.408182 0.425187 -0.148549 -0.179374 -0.131149 -0.011252 0.487634 0.139296 0.147588 0.110983 0.091234 0.109042 0.161497 0.190236 0.079009 0.112742 0.118184 0.115220 0.113978 0.116408 0.118407 0.121399 0.133623 0.130878 0.129518 0.236140
qa: 0.8742 -0.1789 -0.1791 -0.1789 -0.5152 -0.4861 -0.2657 -0.4314 -0.4729 -0.2714 -0.2033 -0.1374 -0.1051 -0.4482 -0.4548 -0.4208 -0.2772 0.1605 0.1526 -0.1590 -0.2183 -0.2034 -0.0975 0.4326 0.3828 0.3759 0.4082 0.4252 -0.1485 -0.1794 -0.1311 -0.0113 0.4876 0.1393 0.1476 0.1110 0.0912 0.1090 0.1615 0.1902 0.0790 0.1127 0.1182 0.1152 0.1140 0.1164 0.1184 0.1214 0.1336 0.1309 0.1295 0.2361
va: 5.8045 1.1227 1.1224 1.1264 1.9659 2.0129 2.1329 2.0598 2.0447 2.1167 3.0912 3.1905 3.2367 2.9695 2.9354 2.9736 3.7883 3.6001 3.6216 3.9314 4.0457 3.8667 3.8909 4.0868 4.3893 4.2594 4.0939 4.2848 3.8799 3.8704 3.8691 3.8631 4.4605 1.0012 1.0064 1.0145 1.0039 1.0020 0.9886 1.0189 1.0034 1.0023 0.9962 0.9873 0.9870 1.0238 0.9874 0.9925 0.9946 1.0067 1.0079 1.0302
dispcorr: -0.029957772 hartree
energy: -2137.186067780943
dipole: 35.87519 -34.44217 1.43302 -10.31255 11.83868 1.52612 -25.37259 24.61358 -0.75901
magnitude: 2.22681 au
magnitude: 5.66011 debye
