program: Orca
programVersion: 5.0.2
elementType: S F F F O O O O O O N N N N N N C C C C C C C C C C C C C C C C C H H H H H H H H H H H H H H H H H H H
charge: 0
multiplicity: 1
keywords: wb97x-d3
keywords: def2-TZVPP
keywords: def2/J RIJCOSX
keywords: DEFGRID2
keywords: scfconv7
keywords: smallprint printgap noloewdin
keywords: NOSOSCF
formula: C17H19F3N6O6S
InChI: InChI=1S/C17H19F3N6O6S/c1-9-6-5-7-10(12(27)31-4)11(9)33(29,30)25-15(28)22-13-21-14(26(2)3)24-16(23-13)32-8-17(18,19)20/h5-7,22,25H,8H2,1-4H3
52 atoms
S  2.635737 -1.392423 -1.48093
F  -4.936293 2.370065 1.997373
F  -6.328121 0.952648 2.818898
F  -7.031056 2.49843 1.487955
O  2.811708 -0.12738 -2.173916
O  2.739232 -2.619581 -2.234964
O  4.02746 1.979543 -0.314934
O  2.060608 1.278876 0.489115
O  1.160673 -3.195262 0.366073
O  -4.825457 -0.203742 0.799168
N  1.107986 -1.267516 -0.832468
N  -0.724784 -1.960492 0.410486
N  -1.653358 2.065471 -1.620286
N  -1.153407 0.06656 -0.635285
N  -2.793783 -1.052155 0.630581
N  -3.301351 1.00903 -0.395006
C  3.740683 -1.405801 -0.082872
C  4.430014 -2.558508 0.320018
C  3.950248 -0.174337 0.552271
C  5.299162 -2.423731 1.405168
C  4.838481 -0.08383 1.610644
C  4.348018 -3.91253 -0.322949
C  5.502644 -1.218248 2.045285
C  3.217359 1.088544 0.214449
C  0.56722 -2.205134 -0.003285
C  -1.579854 -0.930275 0.114767
C  -2.048319 1.040092 -0.873315
C  -3.595995 -0.046758 0.318621
C  -0.310874 2.088424 -2.172956
C  -2.513842 3.186717 -1.931774
C  3.483797 3.265645 -0.62631
C  -5.833054 0.743713 0.517794
C  -6.02587 1.646727 1.71582
H  5.836396 -3.299624 1.745107
H  5.002762 0.866449 2.10204
H  4.946273 -4.616215 0.252766
H  4.74375 -3.902977 -1.337239
H  3.333069 -4.29772 -0.365276
H  6.188641 -1.156393 2.879625
H  -1.112909 -2.678307 1.010135
H  -0.186549 3.010252 -2.735683
H  -0.136626 1.252912 -2.852182
H  0.444433 2.068374 -1.389258
H  -2.042344 4.116854 -1.612315
H  -3.468269 3.094421 -1.425969
H  -2.692997 3.243564 -3.006525
H  3.106603 3.765805 0.26592
H  4.305677 3.841668 -1.041935
H  2.687009 3.189012 -1.367089
H  -5.615159 1.341476 -0.367486
H  -6.755214 0.186648 0.345651
H  0.547912 -0.426663 -1.044344
elementType: S F O N C H
totalener: -2137.15499253 hartree
nucrepener: 3900.17302725 hartree
electener: -6037.32801978 hartree
twoeener: 4658.87786341 hartree
cpcmener: -0.04751144 hartree
kineticenergy: 2129.55161678 hartree
xcener: -175.399193257211 hartree
chargesum: -0.0000000
charge: 0.871827 -0.179688 -0.181038 -0.179802 -0.515453 -0.486402 -0.265220 -0.430139 -0.475053 -0.279287 -0.204953 -0.134228 -0.108624 -0.450491 -0.418828 -0.449994 -0.270366 0.158457 0.155072 -0.159380 -0.219529 -0.204524 -0.097147 0.426313 0.386627 0.386503 0.390863 0.430779 -0.159837 -0.178127 -0.132334 -0.006618 0.477698 0.139825 0.147110 0.091250 0.108525 0.111307 0.162044 0.189057 0.113887 0.112775 0.093897 0.114876 0.115599 0.116685 0.122367 0.134683 0.117521 0.126459 0.147661 0.237395
qa: 0.8718 -0.1797 -0.1810 -0.1798 -0.5155 -0.4864 -0.2652 -0.4301 -0.4751 -0.2793 -0.2050 -0.1342 -0.1086 -0.4505 -0.4188 -0.4500 -0.2704 0.1585 0.1551 -0.1594 -0.2195 -0.2045 -0.0971 0.4263 0.3866 0.3865 0.3909 0.4308 -0.1598 -0.1781 -0.1323 -0.0066 0.4777 0.1398 0.1471 0.0912 0.1085 0.1113 0.1620 0.1891 0.1139 0.1128 0.0939 0.1149 0.1156 0.1167 0.1224 0.1347 0.1175 0.1265 0.1477 0.2374
va: 5.8092 1.1176 1.1202 1.1258 1.9652 2.0142 2.1333 2.0613 2.0431 2.1195 3.0895 3.1898 3.2491 2.9681 2.9589 2.9422 3.7901 3.6041 3.6160 3.9298 4.0499 3.8677 3.8890 4.0889 4.3870 4.2415 4.1327 4.2822 3.8695 3.8824 3.8652 3.8674 4.4302 1.0010 1.0062 1.0040 1.0026 1.0139 0.9883 1.0208 1.0020 0.9983 1.0091 0.9873 1.0136 0.9873 0.9929 0.9946 0.9886 1.0177 1.0022 1.0291
dispcorr: -0.030655712 hartree
energy: -2137.185648244198
dipole: 35.68586 -35.49271 0.19315 3.89105 -1.21485 2.67620 -15.57368 15.30461 -0.26907
magnitude: 2.69662 au
magnitude: 6.85427 debye
