program: Orca
programVersion: 5.0.2
elementType: S F F F O O O O O O N N N N N N C C C C C C C C C C C C C C C C C H H H H H H H H H H H H H H H H H H H
charge: 0
multiplicity: 1
keywords: wb97x-d3
keywords: def2-TZVPP
keywords: def2/J RIJCOSX
keywords: DEFGRID2
keywords: scfconv7
keywords: smallprint printgap noloewdin
keywords: NOSOSCF
formula: C17H19F3N6O6S
InChI: InChI=1S/C17H19F3N6O6S/c1-9-6-5-7-10(12(27)31-4)11(9)33(29,30)25-15(28)22-13-21-14(26(2)3)24-16(23-13)32-8-17(18,19)20/h5-7,22,25H,8H2,1-4H3
52 atoms
S  3.097694 -0.178816 -1.002566
F  -7.135124 -0.383387 -1.395836
F  -5.725326 1.187381 -1.779942
F  -7.451431 1.570978 -0.542021
O  3.244435 1.198686 -0.559189
O  3.548519 -0.539777 -2.326979
O  3.756449 1.340237 2.437041
O  1.750257 0.446229 2.007892
O  1.512447 -2.676147 -1.318802
O  -4.726606 -0.634263 0.073677
N  1.458538 -0.450286 -0.877136
N  -0.483092 -1.72675 -0.877998
N  -1.51791 2.642763 0.142648
N  -0.958485 0.486231 -0.369678
N  -2.634205 -1.1704 -0.40785
N  -3.192916 1.056886 0.120218
C  3.843136 -1.232619 0.224365
C  4.568738 -2.385062 -0.112355
C  3.730868 -0.806175 1.554462
C  5.133512 -3.101597 0.945349
C  4.322369 -1.540026 2.568356
C  4.83027 -2.903081 -1.497718
C  5.013351 -2.699536 2.260015
C  2.953102 0.398688 1.991194
C  0.884345 -1.675741 -1.048287
C  -1.383491 -0.750578 -0.536765
C  -1.90133 1.383008 -0.034916
C  -3.476372 -0.204605 -0.076764
C  -0.119084 3.006689 0.009671
C  -2.447414 3.702901 0.472248
C  3.155508 2.544565 2.922829
C  -5.752007 0.277653 0.410023
C  -6.515852 0.662622 -0.838462
H  5.691679 -4.000234 0.716774
H  4.237649 -1.213455 3.59664
H  5.341321 -3.861654 -1.428391
H  5.475584 -2.231479 -2.062634
H  3.922316 -3.054185 -2.074373
H  5.46944 -3.283566 3.048139
H  -0.877677 -2.652222 -0.993925
H  -0.002144 4.041241 0.322596
H  0.227319 2.922494 -1.021569
H  0.516256 2.392818 0.645274
H  -3.471969 3.355223 0.401858
H  -2.317405 4.534353 -0.220584
H  -2.271821 4.068058 1.485671
H  2.521709 2.352432 3.788249
H  3.979699 3.189233 3.214677
H  2.572762 3.035883 2.143354
H  -6.425242 -0.235434 1.098128
H  -5.369548 1.173206 0.899681
H  0.848972 0.336622 -0.606991
elementType: S F O N C H
totalener: -2137.15495592 hartree
nucrepener: 3898.64082701 hartree
electener: -6035.79578294 hartree
twoeener: 4657.31973540 hartree
cpcmener: -0.04711359 hartree
kineticenergy: 2129.53614892 hartree
xcener: -175.396075423885 hartree
chargesum: -0.0000000
charge: 0.872701 -0.180645 -0.180007 -0.180135 -0.515665 -0.486691 -0.265283 -0.430788 -0.474399 -0.280154 -0.204556 -0.133413 -0.110999 -0.452843 -0.418667 -0.451140 -0.273972 0.159613 0.153907 -0.158361 -0.218739 -0.202628 -0.099827 0.430813 0.385216 0.388273 0.392103 0.429214 -0.147245 -0.176384 -0.130313 -0.008961 0.479591 0.139348 0.147272 0.090903 0.109078 0.110156 0.162191 0.188940 0.112945 0.118543 0.078923 0.114481 0.115285 0.116616 0.121728 0.133746 0.116761 0.148223 0.127010 0.238236
qa: 0.8727 -0.1806 -0.1800 -0.1801 -0.5157 -0.4867 -0.2653 -0.4308 -0.4744 -0.2802 -0.2046 -0.1334 -0.1110 -0.4528 -0.4187 -0.4511 -0.2740 0.1596 0.1539 -0.1584 -0.2187 -0.2026 -0.0998 0.4308 0.3852 0.3883 0.3921 0.4292 -0.1472 -0.1764 -0.1303 -0.0090 0.4796 0.1393 0.1473 0.0909 0.1091 0.1102 0.1622 0.1889 0.1129 0.1185 0.0789 0.1145 0.1153 0.1166 0.1217 0.1337 0.1168 0.1482 0.1270 0.2382
va: 5.8038 1.1209 1.1173 1.1245 1.9639 2.0125 2.1328 2.0604 2.0434 2.1218 3.0895 3.1890 3.2523 2.9689 2.9595 2.9372 3.7899 3.5978 3.6210 3.9304 4.0476 3.8672 3.8906 4.0881 4.3866 4.2388 4.1307 4.2834 3.8778 3.8832 3.8688 3.8677 4.4246 1.0010 1.0061 1.0041 1.0019 1.0146 0.9882 1.0209 1.0019 0.9956 1.0060 1.0122 0.9883 0.9864 0.9924 0.9946 0.9886 1.0022 1.0180 1.0277
dispcorr: -0.030627147 hartree
energy: -2137.185583071830
dipole: 38.30906 -38.30839 0.00067 8.47608 -6.75177 1.72431 15.79691 -12.46895 3.32796
magnitude: 3.74814 au
magnitude: 9.52701 debye
