program: Orca
programVersion: 5.0.2
elementType: S F F F O O O O O O N N N N N N C C C C C C C C C C C C C C C C C H H H H H H H H H H H H H H H H H H H
charge: 0
multiplicity: 1
keywords: wb97x-d3
keywords: def2-TZVPP
keywords: def2/J RIJCOSX
keywords: DEFGRID2
keywords: scfconv7
keywords: smallprint printgap noloewdin
keywords: NOSOSCF
formula: C17H19F3N6O6S
InChI: InChI=1S/C17H19F3N6O6S/c1-9-6-5-7-10(12(27)31-4)11(9)33(29,30)25-15(28)22-13-21-14(26(2)3)24-16(23-13)32-8-17(18,19)20/h5-7,22,25H,8H2,1-4H3
52 atoms
S  2.075127 -2.370305 -0.832711
F  -4.022933 2.953701 4.372431
F  -4.588776 4.04515 2.600893
F  -2.68579 3.057684 2.682923
O  1.976961 -2.096647 -2.257382
O  2.186867 -3.739885 -0.386835
O  3.251043 0.528145 -2.960595
O  1.54959 0.898878 -1.555993
O  1.196583 -1.966308 1.976242
O  -4.503552 1.613052 1.102379
N  0.683391 -1.691755 -0.217901
N  -0.705123 -0.874569 1.453367
N  -2.482797 0.150066 -2.668214
N  -1.560775 -0.373322 -0.644797
N  -2.60601 0.361395 1.330138
N  -3.532778 0.920766 -0.762898
C  3.395393 -1.374922 -0.171312
C  4.264404 -1.83787 0.827431
C  3.554636 -0.106873 -0.745453
C  5.26323 -0.956421 1.246518
C  4.570672 0.726262 -0.309506
C  4.246768 -3.198109 1.463814
C  5.417388 0.301652 0.700011
C  2.648556 0.467883 -1.793226
C  0.449405 -1.550141 1.118168
C  -1.652853 -0.27809 0.663606
C  -2.535443 0.240936 -1.342937
C  -3.499718 0.937595 0.547809
C  -1.400597 -0.573136 -3.310101
C  -3.496264 0.718076 -3.531908
C  2.518145 1.089783 -4.053933
C  -4.615494 1.678161 2.509298
C  -3.968604 2.942703 3.036071
H  5.9426 -1.281338 2.023819
H  4.69602 1.706364 -0.751265
H  5.001242 -3.232741 2.247281
H  4.486078 -3.982195 0.747332
H  3.290053 -3.441944 1.916836
H  6.206213 0.952189 1.05344
H  -0.847541 -0.766125 2.450098
H  -1.437952 -1.641332 -3.092545
H  -0.428262 -0.187249 -3.010842
H  -1.49239 -0.444327 -4.385391
H  -3.930141 -0.061274 -4.15985
H  -3.060467 1.478884 -4.181243
H  -4.289035 1.173018 -2.949033
H  2.217856 2.116697 -3.849537
H  3.195943 1.074465 -4.902469
H  1.638271 0.489628 -4.285191
H  -5.681382 1.707345 2.738359
H  -4.178003 0.810451 3.002568
H  0.011302 -1.264548 -0.874085
elementType: S F O N C H
totalener: -2137.15386452 hartree
nucrepener: 3940.03947673 hartree
electener: -6077.19334125 hartree
twoeener: 4698.90462329 hartree
cpcmener: -0.04623881 hartree
kineticenergy: 2129.55212936 hartree
xcener: -175.398863371140 hartree
chargesum: -0.0000000
charge: 0.872348 -0.179776 -0.181545 -0.176791 -0.514198 -0.486174 -0.263846 -0.429434 -0.472147 -0.282912 -0.206204 -0.140440 -0.104121 -0.447854 -0.455809 -0.418348 -0.277996 0.158100 0.159901 -0.157130 -0.216204 -0.203793 -0.100154 0.425305 0.382960 0.378255 0.406579 0.432477 -0.145147 -0.179023 -0.132234 -0.000792 0.473999 0.138908 0.147647 0.091279 0.109339 0.110037 0.161873 0.191081 0.118811 0.075009 0.112610 0.115029 0.114304 0.116122 0.121433 0.134621 0.118422 0.148057 0.121165 0.236405
qa: 0.8723 -0.1798 -0.1815 -0.1768 -0.5142 -0.4862 -0.2638 -0.4294 -0.4721 -0.2829 -0.2062 -0.1404 -0.1041 -0.4479 -0.4558 -0.4183 -0.2780 0.1581 0.1599 -0.1571 -0.2162 -0.2038 -0.1002 0.4253 0.3830 0.3783 0.4066 0.4325 -0.1451 -0.1790 -0.1322 -0.0008 0.4740 0.1389 0.1476 0.0913 0.1093 0.1100 0.1619 0.1911 0.1188 0.0750 0.1126 0.1150 0.1143 0.1161 0.1214 0.1346 0.1184 0.1481 0.1212 0.2364
va: 5.8042 1.1241 1.1187 1.1211 1.9669 2.0132 2.1325 2.0594 2.0456 2.1210 3.0885 3.1996 3.2379 2.9722 2.9116 2.9683 3.7911 3.6003 3.6131 3.9274 4.0467 3.8673 3.8890 4.0929 4.3874 4.2520 4.0966 4.2678 3.8787 3.8710 3.8663 3.8634 4.4270 1.0010 1.0049 1.0040 1.0021 1.0142 0.9883 1.0178 0.9964 1.0047 1.0021 0.9875 0.9871 1.0235 0.9933 0.9946 0.9881 1.0018 1.0269 1.0315
dispcorr: -0.030778084 hartree
energy: -2137.184642607021
dipole: 21.28950 -21.33437 -0.04488 -13.93730 15.14372 1.20642 -28.37189 27.23346 -1.13843
magnitude: 1.65936 au
magnitude: 4.21776 debye
