program: Orca
programVersion: 5.0.2
elementType: S F F F O O O O O O N N N N N N C C C C C C C C C C C C C C C C C H H H H H H H H H H H H H H H H H H H
charge: 0
multiplicity: 1
keywords: wb97x-d3
keywords: def2-TZVPP
keywords: def2/J RIJCOSX
keywords: DEFGRID2
keywords: scfconv7
keywords: smallprint printgap noloewdin
keywords: NOSOSCF
formula: C17H19F3N6O6S
InChI: InChI=1S/C17H19F3N6O6S/c1-9-6-5-7-10(12(27)31-4)11(9)33(29,30)25-15(28)22-13-21-14(26(2)3)24-16(23-13)32-8-17(18,19)20/h5-7,22,25H,8H2,1-4H3
52 atoms
S  2.975572 0.763659 0.355125
F  -5.546204 -0.245157 -4.521567
F  -4.117527 1.083588 -3.606993
F  -6.187648 1.204508 -3.056261
O  2.805043 1.320849 1.686618
O  3.694793 1.529516 -0.634605
O  2.789003 -0.804441 3.811849
O  1.078217 -1.115489 2.403129
O  1.904931 -0.555781 -2.10026
O  -4.787388 -0.05625 -1.047347
N  1.410028 0.509963 -0.155788
N  -0.264239 -0.25939 -1.568315
N  -2.132641 1.765818 2.118002
N  -1.165352 0.766421 0.304888
N  -2.526417 -0.189021 -1.358868
N  -3.513222 0.83796 0.51944
C  3.682333 -0.862562 0.534546
C  4.633846 -1.374368 -0.359593
C  3.302337 -1.575849 1.679675
C  5.151401 -2.638793 -0.069202
C  3.858421 -2.817033 1.938013
C  5.175731 -0.681684 -1.575675
C  4.778262 -3.351836 1.051856
C  2.257119 -1.111806 2.64875
C  1.085822 -0.121684 -1.320183
C  -1.35103 0.127103 -0.828972
C  -2.283629 1.11401 0.969437
C  -3.552631 0.203708 -0.627037
C  -0.804838 2.083952 2.609654
C  -3.256732 2.218633 2.909602
C  1.904981 -0.362667 4.845319
C  -5.00212 -0.690771 -2.290182
C  -5.209899 0.349932 -3.371989
H  5.88036 -3.063735 -0.74701
H  3.56822 -3.368763 2.822973
H  5.833187 -1.364054 -2.111032
H  5.764184 0.195691 -1.31148
H  4.397838 -0.364577 -2.264226
H  5.210877 -4.324864 1.243088
H  -0.481059 -0.737637 -2.434057
H  -0.281251 2.777873 1.950602
H  -0.198863 1.18799 2.730333
H  -0.902465 2.554369 3.584734
H  -3.245528 3.306172 2.996216
H  -3.205484 1.793108 3.912621
H  -4.193379 1.917403 2.454099
H  2.535448 -0.156033 5.705199
H  1.383796 0.549638 4.553567
H  1.178057 -1.131808 5.105522
H  -4.18882 -1.361512 -2.568937
H  -5.915439 -1.277524 -2.18556
H  0.638276 0.809884 0.460787
elementType: S F O N C H
totalener: -2137.15428143 hartree
nucrepener: 3914.58710848 hartree
electener: -6051.74138991 hartree
twoeener: 4673.33061766 hartree
cpcmener: -0.04619313 hartree
kineticenergy: 2129.56231258 hartree
xcener: -175.401121586484 hartree
chargesum: -0.0000000
charge: 0.875498 -0.179971 -0.177452 -0.181228 -0.514898 -0.485173 -0.264439 -0.429821 -0.474480 -0.281178 -0.204255 -0.139343 -0.104993 -0.448155 -0.454109 -0.418528 -0.274337 0.160113 0.151447 -0.159223 -0.216872 -0.208836 -0.099675 0.427118 0.384891 0.380262 0.407347 0.429080 -0.151095 -0.179228 -0.131037 -0.004787 0.476422 0.139976 0.147225 0.091673 0.108440 0.113746 0.162178 0.190411 0.116234 0.082478 0.112833 0.115785 0.113065 0.116737 0.134664 0.116932 0.121955 0.124082 0.147096 0.235424
qa: 0.8755 -0.1800 -0.1775 -0.1812 -0.5149 -0.4852 -0.2644 -0.4298 -0.4745 -0.2812 -0.2043 -0.1393 -0.1050 -0.4482 -0.4541 -0.4185 -0.2743 0.1601 0.1514 -0.1592 -0.2169 -0.2088 -0.0997 0.4271 0.3849 0.3803 0.4073 0.4291 -0.1511 -0.1792 -0.1310 -0.0048 0.4764 0.1400 0.1472 0.0917 0.1084 0.1137 0.1622 0.1904 0.1162 0.0825 0.1128 0.1158 0.1131 0.1167 0.1347 0.1169 0.1220 0.1241 0.1471 0.2354
va: 5.8046 1.1254 1.1190 1.1194 1.9657 2.0153 2.1319 2.0621 2.0426 2.1201 3.0891 3.1995 3.2401 2.9738 2.9185 2.9684 3.7930 3.6034 3.6255 3.9296 4.0459 3.8687 3.8905 4.0952 4.3865 4.2495 4.0959 4.2742 3.8751 3.8697 3.8658 3.8707 4.4279 1.0008 1.0060 1.0039 1.0025 1.0137 0.9883 1.0184 0.9972 1.0062 1.0024 0.9875 0.9876 1.0239 0.9947 0.9890 0.9930 1.0251 1.0019 1.0321
dispcorr: -0.030575261 hartree
energy: -2137.184856692808
dipole: 28.03101 -28.46143 -0.43042 -3.83408 1.90787 -1.92621 33.08062 -30.65329 2.42733
magnitude: 3.12849 au
magnitude: 7.95199 debye
