program: Orca
programVersion: 5.0.2
elementType: S F F F O O O O O O N N N N N N C C C C C C C C C C C C C C C C C H H H H H H H H H H H H H H H H H H H
charge: 0
multiplicity: 1
keywords: wb97x-d3
keywords: def2-TZVPP
keywords: def2/J RIJCOSX
keywords: DEFGRID2
keywords: scfconv7
keywords: smallprint printgap noloewdin
keywords: NOSOSCF
formula: C17H19F3N6O6S
InChI: InChI=1S/C17H19F3N6O6S/c1-9-6-5-7-10(12(27)31-4)11(9)33(29,30)25-15(28)22-13-21-14(26(2)3)24-16(23-13)32-8-17(18,19)20/h5-7,22,25H,8H2,1-4H3
52 atoms
S  2.205619 -0.433185 -1.381995
F  -2.096868 4.188677 0.608879
F  -2.624993 4.112912 -1.472773
F  -0.555032 4.297074 -0.898905
O  2.085279 1.013758 -1.309527
O  2.57933 -1.039427 -2.638587
O  2.898134 2.078738 1.408779
O  1.094378 0.764209 1.567212
O  1.16325 -3.182986 -0.865737
O  -2.794271 1.667451 -0.217666
N  0.691466 -0.963847 -0.928773
N  -0.938439 -2.530678 -0.381727
N  -5.341283 -1.949231 0.694881
N  -3.12851 -2.259519 0.156597
N  -1.803267 -0.375978 -0.31547
N  -4.068849 -0.09008 0.241345
C  3.287595 -0.955086 -0.067191
C  4.19621 -2.013753 -0.209895
C  3.229348 -0.1998 1.111794
C  4.999621 -2.304775 0.894859
C  4.062687 -0.510432 2.173025
C  4.415063 -2.834767 -1.447245
C  4.937534 -1.578106 2.066588
C  2.26831 0.925778 1.353034
C  0.368933 -2.276422 -0.742853
C  -1.997106 -1.684235 -0.171955
C  -4.162513 -1.425174 0.359842
C  -2.886519 0.35277 -0.093768
C  -5.551622 -3.372343 0.84543
C  -6.518018 -1.140942 0.929018
C  2.123621 3.241616 1.715861
C  -1.534994 2.215555 -0.563109
C  -1.715492 3.712986 -0.579997
H  5.702465 -3.124209 0.817906
H  4.022323 0.071341 3.084713
H  3.503582 -3.29063 -1.822503
H  5.118115 -3.635311 -1.22477
H  4.845285 -2.238731 -2.251151
H  5.581639 -1.834412 2.897131
H  -1.145192 -3.512995 -0.247546
H  -6.294412 -3.720288 0.124915
H  -5.925591 -3.588644 1.847879
H  -4.632157 -3.924851 0.690919
H  -6.871954 -1.282617 1.952065
H  -7.31752 -1.442603 0.249882
H  -6.30918 -0.088602 0.775697
H  2.827736 4.068404 1.737561
H  1.372977 3.429663 0.94879
H  1.639754 3.153006 2.688263
H  -0.769767 1.960731 0.172585
H  -1.20239 1.881402 -1.548967
H  -0.035582 -0.255855 -0.755646
elementType: S F O N C H
totalener: -2137.15489748 hartree
nucrepener: 3978.43415780 hartree
electener: -6115.58905527 hartree
twoeener: 4736.80171673 hartree
cpcmener: -0.04450345 hartree
kineticenergy: 2129.54556038 hartree
xcener: -175.398667403071 hartree
chargesum: -0.0000000
charge: 0.872987 -0.181504 -0.178428 -0.179751 -0.515570 -0.484426 -0.265236 -0.434656 -0.474134 -0.273687 -0.202900 -0.138730 -0.093756 -0.449984 -0.459807 -0.417486 -0.264779 0.156457 0.151841 -0.158622 -0.218506 -0.205231 -0.097836 0.431233 0.384240 0.379334 0.406495 0.406674 -0.169379 -0.169494 -0.124876 0.007228 0.497466 0.139213 0.147624 0.110081 0.091520 0.109681 0.162043 0.189931 0.110645 0.109569 0.117988 0.110362 0.109327 0.118861 0.133551 0.108626 0.120915 0.109205 0.133904 0.231781
qa: 0.8730 -0.1815 -0.1784 -0.1798 -0.5156 -0.4844 -0.2652 -0.4347 -0.4741 -0.2737 -0.2029 -0.1387 -0.0938 -0.4500 -0.4598 -0.4175 -0.2648 0.1565 0.1518 -0.1586 -0.2185 -0.2052 -0.0978 0.4312 0.3842 0.3793 0.4065 0.4067 -0.1694 -0.1695 -0.1249 0.0072 0.4975 0.1392 0.1476 0.1101 0.0915 0.1097 0.1620 0.1899 0.1106 0.1096 0.1180 0.1104 0.1093 0.1189 0.1336 0.1086 0.1209 0.1092 0.1339 0.2318
va: 5.8005 1.1217 1.1276 1.1223 1.9650 2.0158 2.1366 2.0591 2.0438 2.1306 3.0888 3.1916 3.2457 2.9820 2.9230 2.9700 3.7827 3.6043 3.6259 3.9270 4.0498 3.8688 3.8896 4.0878 4.3869 4.2454 4.1232 4.2929 3.8629 3.8604 3.8654 3.8569 4.4541 1.0011 1.0056 1.0146 1.0040 1.0017 0.9883 1.0190 0.9916 0.9916 1.0236 0.9918 0.9914 1.0252 0.9952 0.9983 0.9940 1.0175 1.0063 1.0360
dispcorr: -0.030391784 hartree
energy: -2137.185289261407
dipole: -0.27608 -0.63191 -0.90799 -27.86653 26.39991 -1.46662 11.67255 -9.26232 2.41023
magnitude: 2.96389 au
magnitude: 7.53361 debye
