program: Gaussian 09
title: 000073954
version: EM64L-G09RevD.01
frameworkgroup: C1[X(C8H9N)]
method: RPBEPBE
basis: SDD
operation: Freq
keyword: #p
keyword: freq=noraman
keyword: PBEPBE/SDD
title: #p freq=noraman PBEPBE/SDD
converged: YES YES NO NO
title: Mulliken charges:
elementType: N C C C C C C C C H H H H H H H H H
charge: -0.055750 0.430802 -0.380370 -0.364539 -0.225090 -0.218536 -0.232317 -0.338879 -0.657697 0.225288 0.274774 0.227246 0.227504 0.228983 0.192377 0.188262 0.238938 0.239002
chargesum: 0.00000
title: Mulliken charges with hydrogens summed into heavy atoms:
elementType: N C C C C C C C C
charge: -0.055750 0.430802 -0.155082 -0.089765 0.002156 0.008969 -0.003334 -0.146502 0.008505
polarizability: 1.52408358e+02 -3.82532540e+00 9.27230602e+01 -1.88453487e-02 -2.17860334e-03 4.15934557e+01
1716.lowfreq: -15.1145 -3.2789 -0.0006 -0.0001 0.0005 8.0380 93.3325 135.9388 141.5583
frequency: 93.3013 135.8955 141.5546 211.0232 299.8377 345.1924 406.9020 412.6781 506.9246 614.0128 632.0760 701.2373 769.8578 842.1170 859.5955 926.4098 971.9670 973.0936 987.4351 988.9214 1007.4533 1022.7140 1081.1184 1101.9523 1105.5940 1171.3761 1180.4261 1232.8998 1313.4148 1359.6270 1393.3742 1410.8075 1438.9187 1450.2855 1469.1683 1481.8373 1585.8858 1610.7886 1636.6200 2899.5251 2907.5662 3026.2133 3054.2477 3114.9758 3127.6855 3141.2033 3155.7963 3166.5775
redmass: 2.6804 1.7243 3.4889 1.7598 2.8687 3.9675 2.8325 4.5056 2.7794 6.4617 5.5650 1.8073 1.6615 4.0363 1.2493 1.3319 1.5403 5.5657 1.3732 6.2968 1.3429 2.1089 1.5711 1.4157 1.4351 1.0633 1.1086 2.1709 1.4360 1.6930 4.4185 1.1836 2.1121 1.0447 1.0824 2.3800 6.2010 6.0106 6.8366 1.0798 1.0504 1.0859 1.0987 1.0873 1.0868 1.0919 1.0958 1.1006
irintensity: 0.1341 9.5304 4.5763 16.7256 1.3348 3.3791 0.1107 2.5797 14.6998 0.0072 6.3415 51.3841 52.6806 4.3387 0.1581 0.0677 17.0194 13.9812 0.0084 0.1664 2.1045 7.3592 7.1639 6.1010 0.1719 0.9636 3.0726 12.1363 9.8950 2.7309 0.5876 4.1272 15.2551 10.1006 25.6789 9.6496 8.9745 3.6531 56.0619 26.5223 186.8146 34.8191 23.2205 8.8857 0.8925 25.7283 22.6607 22.0657
temp: 298.150 k
press: 1.00000 atm
elementType: 7 6 6 6 6 6 6 6 6 1 1 1 1 1 1 1 1 1
symmnumber: 1
zpe: 385604.8 jmol-1
zpe.correction: 0.146869 hartree
zpe.thermalcorrener: 0.155022 hartree
zpe.thermalcorrenthalpy: 0.155966 hartree
zpe.thermalcorrgfe: 0.113929 hartree
zpe.sumelectzpe: -364.331716 hartree
zpe.sumelectthermal: -364.323563 hartree
zpe.sumelectthermalent: -364.322619 hartree
zpe.sumelectthermalfe: -364.364656 hartree
dipole: 0.0413 1.3895 0.0020
dipole: 1.3902
quadrupole: -42.8097 -48.9409 -57.5688
quadrupole: 2.8972 -0.0017 -0.0016
quadrupole: 6.9635 0.8322 -7.7957 2.8972 -0.0017 -0.0016
hfenergy: -364.4785848 hartree
pointgroup: C01[X(C8H9N1)]
dipole: 0.009778 0.5435907 0.059554 debye
dipolederiv: -0.5998799 -0.059821 -0.004237 0.3071289 -0.4165135 -0.0117013 0.0351667 -0.0081304 -0.3370025 -0.1895539 -0.0384551 -0.0024278 -0.10961 -0.082608 -0.0096581 -0.0096641 -0.0103084 0.0143981 -0.0170271 0.1011324 0.0094317 -0.0268886 0.0656153 0.0266312 -0.0042601 0.0255266 -0.175382 -0.0393012 -0.0970547 -0.0113456 0.0033784 -0.0134893 0.0123204 -0.0003346 0.0130881 -0.1263918 -0.0008857 -0.1331392 -0.0158427 -0.1846076 0.0148285 0.0200935 -0.0215509 0.0196849 -0.153013 -0.1063899 0.1040743 0.0107799 0.1267382 0.1235317 0.0291315 0.0132171 0.0293242 -0.1526856 0.0589279 0.0216954 0.0003414 0.010869 -0.0180019 0.0152343 -0.0006711 0.0151839 -0.1579823 0.8098113 0.0333009 -0.0034961 0.1428253 0.4730464 0.0536417 0.0078272 0.0545577 -0.0260843 0.2841775 0.0520167 0.0048459 0.136281 0.2974137 0.0146168 0.0153027 0.0150119 0.1595055 0.0647629 -0.0956568 -0.0095136 -0.0608022 -0.086853 -0.0259712 -0.0056958 -0.0256933 0.1550917 0.0759979 0.0896835 0.0104265 0.0603147 0.0287586 -0.0141154 0.0072067 -0.0143026 0.1528615 -0.0238815 0.1034532 0.0128584 0.1200684 -0.0338676 -0.0221721 0.0146681 -0.0220418 0.1581967 0.0456198 -0.0662948 -0.0062053 -0.0875329 -0.1010296 -0.0270882 -0.0085052 -0.0272572 0.1533211 -0.1314871 -0.0399922 -0.0017103 -0.0429669 0.0836627 -0.0081528 -0.0020155 -0.0081946 0.1615554 -0.0253757 -0.0451787 -0.0033932 -0.0911703 -0.2390334 -0.0430088 -0.0084214 -0.0438085 0.1609982 -0.0990427 0.0071855 0.0022531 -0.233903 -0.2294845 -0.0341897 -0.0245886 -0.0358849 0.0916521 -0.0516971 0.0231179 0.074783 -0.0532858 0.0853971 -0.0779611 0.1540674 -0.061527 -0.0596568 -0.0547756 0.0399329 -0.0675481 -0.0168367 0.0486269 0.1023493 -0.1617484 0.0847715 -0.019382 unknown
polarizability: 152.4828062|-2.9958534|92.0441084|-1.2715285|5.4854479|42.1979592 unknown
InChI: InChI=1S/C8H9N/c1-9-7-8-5-3-2-4-6-8/h2-7H,1H3
charge 0 multiplicity 1
18 atoms
N  2.44015 -0.370501 -0.067318
C  0.078137 0.249668 0.018939
C  -0.859837 1.309382 0.142246
C  -0.395951 -1.084189 -0.121327
C  -2.247079 1.044831 0.126126
C  -1.779641 -1.34641 -0.13721
C  -2.710393 -0.28371 -0.013698
C  1.525585 0.55454 0.039497
C  3.856402 0.025052 -0.034743
H  -0.498936 2.340416 0.250746
H  0.342741 -1.887011 -0.214554
H  -2.963234 1.86853 0.221914
H  -2.139658 -2.375808 -0.24542
H  -3.786346 -0.491458 -0.026574
H  1.783765 1.634003 0.154717
H  4.033081 1.118939 0.085107
H  4.34396 -0.311621 -0.969079
H  4.357454 -0.507353 0.795532
