program: Orca
programVersion: 5.0.2
elementType: S F F F O O O O O O N N N N N N C C C C C C C C C C C C C C C C C H H H H H H H H H H H H H H H H H H H
charge: 0
multiplicity: 1
keywords: wb97x-d3
keywords: def2-TZVPP
keywords: def2/J RIJCOSX
keywords: DEFGRID2
keywords: scfconv7
keywords: smallprint printgap noloewdin
keywords: NOSOSCF
formula: C17H19F3N6O6S
InChI: InChI=1S/C17H19F3N6O6S/c1-9-6-5-7-10(12(27)31-4)11(9)33(29,30)25-15(28)22-13-21-14(26(2)3)24-16(23-13)32-8-17(18,19)20/h5-7,22,25H,8H2,1-4H3
52 atoms
S  1.942796 -2.689247 0.451308
F  -5.244905 4.732634 -0.70946
F  -3.74445 4.951304 -2.245058
F  -3.251268 3.954112 -0.407035
O  2.063587 -3.955849 -0.222387
O  1.403088 -2.629851 1.796207
O  1.622402 0.245658 1.687613
O  2.81692 -0.222337 3.517555
O  2.045933 -1.515646 -2.365318
O  -3.582487 2.133573 -2.479989
N  0.895721 -1.70468 -0.407236
N  0.065884 -0.453671 -2.175732
N  -2.998229 -0.455568 1.261341
N  -1.439756 -0.465485 -0.408597
N  -1.795389 0.83256 -2.344718
N  -3.355333 0.894283 -0.577201
C  3.513195 -1.839366 0.445735
C  4.567397 -2.25933 -0.379483
C  3.692169 -0.822028 1.39301
C  5.784998 -1.592679 -0.234678
C  4.93249 -0.217367 1.522812
C  4.52538 -3.378082 -1.381101
C  5.974637 -0.592896 0.695853
C  2.654901 -0.284408 2.333487
C  1.084702 -1.270236 -1.68273
C  -1.098293 -0.021406 -1.608479
C  -2.59819 0.003601 0.070319
C  -2.894496 1.259655 -1.752703
C  -2.292059 -1.561181 1.882308
C  -4.240189 -0.022468 1.862454
C  0.615744 0.840035 2.495622
C  -4.67702 2.804913 -1.905071
C  -4.216506 4.125225 -1.312435
H  6.609376 -1.888976 -0.869968
H  5.077228 0.548962 2.271702
H  5.451497 -3.376494 -1.953374
H  3.699887 -3.282892 -2.078725
H  4.438662 -4.347554 -0.894526
H  6.939322 -0.112089 0.786592
H  0.245404 -0.086814 -3.099284
H  -2.305129 -2.454806 1.256986
H  -2.783426 -1.798921 2.822139
H  -1.253071 -1.320932 2.101075
H  -5.041677 -0.747223 1.699826
H  -4.547981 0.930564 1.44649
H  -4.099795 0.098332 2.935989
H  -0.170527 1.151273 1.813055
H  0.215843 0.132429 3.222265
H  0.996885 1.709481 3.03203
H  -5.384908 3.004006 -2.710332
H  -5.171475 2.210599 -1.136101
H  0.047122 -1.398923 0.079645
totalener: -2137.11371783 hartree
nucrepener: 3945.06604497 hartree
electener: -6082.17976281 hartree
twoeener: 4701.53029757 hartree
kineticenergy: 2129.63720612 hartree
xcener: -175.404286845540 hartree
chargesum: 0.0000000
charge: 0.865705 -0.172680 -0.162511 -0.168646 -0.435177 -0.477734 -0.261747 -0.338966 -0.398072 -0.244093 -0.193174 -0.156591 -0.128600 -0.451437 -0.359083 -0.440673 -0.333171 0.196252 0.162347 -0.141024 -0.209124 -0.206760 -0.072974 0.387845 0.362286 0.385574 0.374357 0.391259 -0.149282 -0.175000 -0.164305 -0.038834 0.475732 0.108798 0.124627 0.068449 0.128428 0.108147 0.131863 0.174068 0.121157 0.098513 0.090636 0.113778 0.112970 0.101000 0.115708 0.114659 0.131932 0.130311 0.113440 0.189818
qa: 0.8657 -0.1727 -0.1625 -0.1686 -0.4352 -0.4777 -0.2617 -0.3390 -0.3981 -0.2441 -0.1932 -0.1566 -0.1286 -0.4514 -0.3591 -0.4407 -0.3332 0.1963 0.1623 -0.1410 -0.2091 -0.2068 -0.0730 0.3878 0.3623 0.3856 0.3744 0.3913 -0.1493 -0.1750 -0.1643 -0.0388 0.4757 0.1088 0.1246 0.0684 0.1284 0.1081 0.1319 0.1741 0.1212 0.0985 0.0906 0.1138 0.1130 0.1010 0.1157 0.1147 0.1319 0.1303 0.1134 0.1898
va: 5.8049 1.1343 1.1459 1.1317 2.0716 2.0040 2.0927 2.1669 2.1173 2.1586 3.1013 3.1749 3.2056 2.9386 2.9734 2.9466 3.9058 3.6266 3.6756 3.9738 4.0787 3.8945 3.9275 4.1507 4.3792 4.2072 4.1182 4.3144 3.8932 3.8972 3.8887 3.9228 4.4263 1.0101 1.0170 1.0040 1.0126 1.0029 0.9990 1.0329 0.9982 1.0046 0.9885 0.9880 1.0120 0.9929 0.9909 0.9890 1.0018 1.0059 1.0206 1.0674
dispcorr: -0.031866790 hartree
energy: -2137.145584623647
dipole: 14.17623 -15.74792 -1.57169 -22.68566 23.49088 0.80522 14.50243 -14.36692 0.13551
magnitude: 1.77114 au
magnitude: 4.50189 debye
