program: Orca
programVersion: 5.0.2
elementType: S F F F O O O O O O N N N N N N C C C C C C C C C C C C C C C C C H H H H H H H H H H H H H H H H H H H
charge: 0
multiplicity: 1
keywords: wb97x-d3
keywords: def2-TZVPP
keywords: def2/J RIJCOSX
keywords: DEFGRID2
keywords: scfconv7
keywords: smallprint printgap noloewdin
keywords: NOSOSCF
formula: C17H19F3N6O6S
InChI: InChI=1S/C17H19F3N6O6S/c1-9-6-5-7-10(12(27)31-4)11(9)33(29,30)25-15(28)22-13-21-14(26(2)3)24-16(23-13)32-8-17(18,19)20/h5-7,22,25H,8H2,1-4H3
52 atoms
S  2.526369 -0.802571 1.693817
F  -1.757448 4.283858 -0.335451
F  -3.880436 4.617412 -0.54243
F  -2.940989 2.929476 -1.510828
O  2.809128 -1.680405 2.79898
O  2.516449 0.631977 1.886742
O  1.693041 0.936519 -0.863116
O  3.545224 2.186602 -0.733353
O  1.260079 -3.298887 0.542053
O  -2.260279 1.83548 0.967995
N  0.974652 -1.116327 1.123956
N  -0.750483 -2.365209 0.173597
N  -5.023633 -1.255409 -0.977043
N  -2.877409 -1.832834 -0.39828
N  -1.483243 -0.201402 0.581197
N  -3.698457 0.342193 0.012202
C  3.607909 -1.169798 0.318458
C  4.379545 -2.341711 0.279752
C  3.74213 -0.179288 -0.66387
C  5.244567 -2.490828 -0.805219
C  4.644207 -0.358281 -1.700311
C  4.39489 -3.433635 1.311583
C  5.38116 -1.525083 -1.780706
C  2.997347 1.12331 -0.710343
C  0.569653 -2.314869 0.626917
C  -1.734808 -1.423331 0.122354
C  -3.843584 -0.913969 -0.444465
C  -2.515805 0.62095 0.491718
C  -5.28003 -2.57965 -1.493344
C  -6.127525 -0.330703 -1.076389
C  0.88131 2.105908 -0.884951
C  -3.2261 2.85099 0.838106
C  -2.942878 3.675653 -0.404035
H  5.83861 -3.393344 -0.866541
H  4.765708 0.418794 -2.442429
H  5.014084 -4.253558 0.951348
H  3.404524 -3.82496 1.519121
H  4.817542 -3.087457 2.252686
H  6.074681 -1.673761 -2.597556
H  -1.010343 -3.267582 -0.196235
H  -4.408435 -3.211376 -1.370848
H  -5.532341 -2.52735 -2.554595
H  -6.122371 -3.033147 -0.966674
H  -6.968163 -0.67237 -0.468037
H  -6.46512 -0.263128 -2.112393
H  -5.831771 0.656543 -0.742425
H  -0.120264 1.767326 -1.127975
H  0.876884 2.591301 0.090602
H  1.219196 2.817583 -1.637319
H  -4.240166 2.453483 0.791181
H  -3.134462 3.489481 1.71753
H  0.325703 -0.325475 1.092174
totalener: -2137.11551027 hartree
nucrepener: 3968.56206605 hartree
electener: -6105.67757632 hartree
twoeener: 4725.64021330 hartree
kineticenergy: 2129.63006436 hartree
xcener: -175.402722642750 hartree
chargesum: 0.0000000
charge: 0.861634 -0.165860 -0.169413 -0.171343 -0.435528 -0.460616 -0.270251 -0.336615 -0.405093 -0.254927 -0.199439 -0.160260 -0.121778 -0.435228 -0.412500 -0.433183 -0.329950 0.187995 0.157600 -0.139428 -0.205537 -0.206263 -0.078964 0.383595 0.365271 0.394018 0.385012 0.403129 -0.165766 -0.164212 -0.133143 -0.041803 0.484899 0.107150 0.123176 0.067842 0.128583 0.107874 0.130411 0.169021 0.123005 0.099883 0.098455 0.101983 0.099000 0.117963 0.095609 0.129770 0.120118 0.114702 0.135277 0.204127
qa: 0.8616 -0.1659 -0.1694 -0.1713 -0.4355 -0.4606 -0.2703 -0.3366 -0.4051 -0.2549 -0.1994 -0.1603 -0.1218 -0.4352 -0.4125 -0.4332 -0.3300 0.1880 0.1576 -0.1394 -0.2055 -0.2063 -0.0790 0.3836 0.3653 0.3940 0.3850 0.4031 -0.1658 -0.1642 -0.1331 -0.0418 0.4849 0.1072 0.1232 0.0678 0.1286 0.1079 0.1304 0.1690 0.1230 0.0999 0.0985 0.1020 0.0990 0.1180 0.0956 0.1298 0.1201 0.1147 0.1353 0.2041
va: 5.8139 1.1375 1.1417 1.1274 2.0732 2.0272 2.0983 2.1701 2.1083 2.1480 3.1104 3.1769 3.2474 2.9833 2.9414 2.9484 3.8917 3.6385 3.6823 3.9664 4.0743 3.8950 3.9263 4.1751 4.3747 4.1960 4.1530 4.2254 3.8703 3.8854 3.8739 3.9232 4.4024 1.0102 1.0165 1.0039 1.0120 1.0034 0.9993 1.0362 1.0275 0.9935 0.9925 0.9924 0.9941 1.0175 1.0014 0.9969 1.0038 1.0190 1.0053 1.0603
dispcorr: -0.030905067 hartree
energy: -2137.146415340041
dipole: -2.88575 -0.38902 -3.27477 -25.32435 24.44382 -0.88053 -6.18116 4.67404 -1.50713
magnitude: 3.71091 au
magnitude: 9.43239 debye
