program: Orca
programVersion: 5.0.2
elementType: S F F F O O O O O O N N N N N N C C C C C C C C C C C C C C C C C H H H H H H H H H H H H H H H H H H H
charge: 0
multiplicity: 1
keywords: wb97x-d3
keywords: def2-TZVPP
keywords: def2/J RIJCOSX
keywords: DEFGRID2
keywords: scfconv7
keywords: smallprint printgap noloewdin
keywords: NOSOSCF
formula: C17H19F3N6O6S
InChI: InChI=1S/C17H19F3N6O6S/c1-9-6-5-7-10(12(27)31-4)11(9)33(29,30)25-15(28)22-13-21-14(26(2)3)24-16(23-13)32-8-17(18,19)20/h5-7,22,25H,8H2,1-4H3
52 atoms
S  2.835964 -0.357366 -1.191917
F  -4.432473 2.582038 -1.479436
F  -2.981444 4.139801 -1.744764
F  -4.641479 4.439107 -0.394425
O  2.864353 1.061948 -0.902667
O  3.303761 -0.852376 -2.459664
O  3.341192 1.635616 2.030346
O  1.446133 0.480695 1.741687
O  1.45102 -3.015049 -1.152296
O  -1.991799 2.072859 -0.08832
N  1.219522 -0.756887 -0.992677
N  -0.589081 -2.197358 -0.684708
N  -4.870141 -1.397731 0.68353
N  -2.720235 -1.821765 -0.011772
N  -1.275902 0.0006 -0.411886
N  -3.467864 0.388295 0.339339
C  3.668467 -1.192075 0.151565
C  4.476507 -2.318962 -0.050362
C  3.548809 -0.598537 1.412967
C  5.137822 -2.826886 1.069087
C  4.237502 -1.127419 2.491714
C  4.71346 -3.011467 -1.3617
C  5.027773 -2.249496 2.317508
C  2.642537 0.560277 1.70811
C  0.765599 -2.040744 -0.966708
C  -1.559217 -1.294301 -0.356423
C  -3.661099 -0.940122 0.330184
C  -2.281179 0.777963 -0.046906
C  -5.162399 -2.808404 0.77477
C  -5.948926 -0.512176 1.052538
C  2.597146 2.818577 2.294008
C  -2.953401 3.009877 0.331065
C  -3.756544 3.53842 -0.843899
H  5.763831 -3.700578 0.942601
H  4.153952 -0.665206 3.466134
H  5.311299 -3.905066 -1.189933
H  5.255814 -2.377809 -2.06037
H  3.786148 -3.309768 -1.840739
H  5.564469 -2.669903 3.157528
H  -0.878638 -3.162718 -0.6360
H  -5.973744 -3.072513 0.09335
H  -5.475517 -3.06477 1.789415
H  -4.287245 -3.394406 0.519408
H  -5.729268 0.505968 0.752483
H  -6.12273 -0.532289 2.13155
H  -6.866306 -0.831947 0.556219
H  1.94153 2.700044 3.15718
H  3.33157 3.5925 2.498226
H  1.99876 3.102595 1.428505
H  -3.632967 2.597375 1.077742
H  -2.402309 3.840329 0.774196
H  0.575013 0.001115 -0.742998
totalener: -2137.11655353 hartree
nucrepener: 3913.03726243 hartree
electener: -6050.15381597 hartree
twoeener: 4671.02888011 hartree
kineticenergy: 2129.63100119 hartree
xcener: -175.403216952581 hartree
chargesum: 0.0000000
charge: 0.857708 -0.164882 -0.162512 -0.175830 -0.462733 -0.433413 -0.247234 -0.360435 -0.407090 -0.252446 -0.203817 -0.163557 -0.125610 -0.436853 -0.389959 -0.440477 -0.300743 0.169821 0.175502 -0.141115 -0.196166 -0.200378 -0.087788 0.361379 0.365729 0.390668 0.385293 0.424966 -0.165685 -0.163284 -0.139444 -0.033982 0.472814 0.107629 0.114298 0.067358 0.106931 0.130566 0.129181 0.167017 0.098637 0.097578 0.120974 0.115604 0.102453 0.095833 0.105556 0.119768 0.118968 0.108764 0.130374 0.214064
qa: 0.8577 -0.1649 -0.1625 -0.1758 -0.4627 -0.4334 -0.2472 -0.3604 -0.4071 -0.2524 -0.2038 -0.1636 -0.1256 -0.4369 -0.3900 -0.4405 -0.3007 0.1698 0.1755 -0.1411 -0.1962 -0.2004 -0.0878 0.3614 0.3657 0.3907 0.3853 0.4250 -0.1657 -0.1633 -0.1394 -0.0340 0.4728 0.1076 0.1143 0.0674 0.1069 0.1306 0.1292 0.1670 0.0986 0.0976 0.1210 0.1156 0.1025 0.0958 0.1056 0.1198 0.1190 0.1088 0.1304 0.2141
va: 5.8255 1.1360 1.1459 1.1299 2.0260 2.0761 2.1349 2.1302 2.1057 2.1528 3.1087 3.1797 3.2366 2.9833 2.9604 2.9422 3.8708 3.6578 3.6493 3.9675 4.0816 3.8922 3.9364 4.1614 4.3771 4.2012 4.1555 4.2165 3.8744 3.8883 3.8970 3.9243 4.4296 1.0101 1.0168 1.0033 1.0048 1.0117 0.9996 1.0376 0.9937 0.9908 1.0281 1.0179 0.9915 0.9947 0.9934 0.9952 0.9960 1.0229 1.0050 1.0569
dispcorr: -0.028724962 hartree
energy: -2137.145278496153
dipole: 7.75235 -9.43961 -1.68726 -23.94130 23.42411 -0.51719 18.12534 -15.61415 2.51118
magnitude: 3.06926 au
magnitude: 7.80145 debye
