program: Orca
programVersion: 5.0.2
elementType: S F F F O O O O O O N N N N N N C C C C C C C C C C C C C C C C C H H H H H H H H H H H H H H H H H H H
charge: 0
multiplicity: 1
keywords: wb97x-d3
keywords: def2-TZVPP
keywords: def2/J RIJCOSX
keywords: DEFGRID2
keywords: scfconv7
keywords: smallprint printgap noloewdin
keywords: NOSOSCF
formula: C17H19F3N6O6S
InChI: InChI=1S/C17H19F3N6O6S/c1-9-6-5-7-10(12(27)31-4)11(9)33(29,30)25-15(28)22-13-21-14(26(2)3)24-16(23-13)32-8-17(18,19)20/h5-7,22,25H,8H2,1-4H3
52 atoms
S  2.274954 -2.325537 -1.192666
F  -5.543534 3.115642 3.263393
F  -6.70965 1.423336 2.615339
F  -6.998182 3.349527 1.687518
O  2.296365 -1.594517 -2.445611
O  2.241632 -3.764152 -1.197544
O  3.953477 1.014155 -2.187902
O  2.110875 0.992553 -0.918953
O  1.238376 -2.717568 1.600343
O  -4.123227 1.322702 1.728434
N  0.911178 -1.732934 -0.426516
N  -0.529789 -1.343916 1.35774
N  -1.925513 1.123934 -2.270684
N  -1.203238 -0.127571 -0.50045
N  -2.340835 0.004523 1.563292
N  -3.080306 1.278635 -0.280629
C  3.630211 -1.735429 -0.187952
C  4.361085 -2.583065 0.655986
C  3.974168 -0.387341 -0.337342
C  5.423501 -2.009248 1.356298
C  5.048715 0.133498 0.364254
C  4.122655 -4.052061 0.85604
C  5.765947 -0.67961 1.223109
C  3.208884 0.585492 -1.182907
C  0.602351 -1.994229 0.876577
C  -1.383667 -0.453613 0.768786
C  -2.075001 0.75781 -0.995164
C  -3.148885 0.85814 0.962079
C  -0.820759 0.596442 -3.048165
C  -2.774413 2.115467 -2.889456
C  3.357576 1.951153 -3.074885
C  -5.046044 2.209464 1.14143
C  -6.080157 2.520168 2.200003
H  5.997984 -2.639967 2.02203
H  5.321393 1.173316 0.244324
H  4.803163 -4.422904 1.620577
H  4.304763 -4.618469 -0.054776
H  3.106812 -4.261931 1.176833
H  6.599954 -0.276476 1.78174
H  -0.732457 -1.539777 2.327458
H  -0.907616 0.972852 -4.064606
H  -0.840236 -0.492148 -3.090018
H  0.14187 0.906843 -2.641766
H  -3.216775 1.717298 -3.803786
H  -2.202391 3.009769 -3.145435
H  -3.57248 2.398911 -2.21297
H  4.12186 2.19627 -3.806611
H  2.498224 1.513713 -3.583517
H  3.042067 2.857112 -2.556869
H  -4.568523 3.13726 0.815518
H  -5.540185 1.764861 0.273859
H  0.361227 -1.016295 -0.913729
totalener: -2137.11888080 hartree
nucrepener: 3868.81497770 hartree
electener: -6005.93385851 hartree
twoeener: 4625.93932726 hartree
kineticenergy: 2129.63769974 hartree
xcener: -175.405409063272 hartree
chargesum: -0.0000000
charge: 0.858479 -0.162977 -0.162234 -0.173870 -0.475135 -0.432145 -0.245457 -0.374593 -0.401232 -0.230979 -0.208445 -0.157002 -0.124099 -0.437601 -0.365560 -0.447535 -0.307581 0.172792 0.192396 -0.139493 -0.200983 -0.197664 -0.085821 0.369809 0.362799 0.381626 0.393236 0.387638 -0.171347 -0.182797 -0.142234 -0.024643 0.482891 0.108313 0.115134 0.068331 0.105980 0.130318 0.131174 0.171971 0.095987 0.112325 0.108108 0.103520 0.108661 0.114496 0.126977 0.107281 0.111934 0.106992 0.104476 0.217779
qa: 0.8585 -0.1630 -0.1622 -0.1739 -0.4751 -0.4321 -0.2455 -0.3746 -0.4012 -0.2310 -0.2084 -0.1570 -0.1241 -0.4376 -0.3656 -0.4475 -0.3076 0.1728 0.1924 -0.1395 -0.2010 -0.1977 -0.0858 0.3698 0.3628 0.3816 0.3932 0.3876 -0.1713 -0.1828 -0.1422 -0.0246 0.4829 0.1083 0.1151 0.0683 0.1060 0.1303 0.1312 0.1720 0.0960 0.1123 0.1081 0.1035 0.1087 0.1145 0.1270 0.1073 0.1119 0.1070 0.1045 0.2178
va: 5.8236 1.1457 1.1463 1.1316 2.0103 2.0753 2.1394 2.1132 2.1125 2.1548 3.1101 3.1771 3.2131 2.9661 2.9768 2.9540 3.8722 3.6542 3.6009 3.9710 4.0932 3.8911 3.9398 4.1455 4.3783 4.2109 4.1242 4.3180 3.8857 3.8941 3.8996 3.9169 4.4776 1.0101 1.0173 1.0039 1.0048 1.0116 0.9993 1.0345 1.0032 1.0003 1.0092 0.9890 0.9864 1.0197 0.9964 0.9921 0.9930 1.0098 1.0116 1.0411
dispcorr: -0.030246892 hartree
energy: -2137.149127695719
dipole: 36.83693 -36.12099 0.71594 -3.99389 5.90566 1.91177 -25.65772 24.28821 -1.36951
magnitude: 2.45825 au
magnitude: 6.24836 debye
