program: Orca
programVersion: 5.0.2
elementType: S F F F O O O O O O N N N N N N C C C C C C C C C C C C C C C C C H H H H H H H H H H H H H H H H H H H
charge: 0
multiplicity: 1
keywords: wb97x-d3
keywords: def2-TZVPP
keywords: def2/J RIJCOSX
keywords: DEFGRID2
keywords: scfconv7
keywords: smallprint printgap noloewdin
keywords: NOSOSCF
formula: C17H19F3N6O6S
InChI: InChI=1S/C17H19F3N6O6S/c1-9-6-5-7-10(12(27)31-4)11(9)33(29,30)25-15(28)22-13-21-14(26(2)3)24-16(23-13)32-8-17(18,19)20/h5-7,22,25H,8H2,1-4H3
52 atoms
S  2.477852 -2.022349 -1.376974
F  -6.796537 1.136781 2.382454
F  -7.049756 3.114853 1.554584
F  -5.620595 2.776888 3.135047
O  2.601903 -1.030021 -2.428329
O  2.535548 -3.424486 -1.696341
O  4.033153 1.588093 -1.345077
O  2.073265 1.100065 -0.387034
O  1.145608 -3.00941 1.145087
O  -4.223409 1.01841 1.494549
N  0.998566 -1.662342 -0.686317
N  -0.619451 -1.61694 0.981388
N  -1.684112 1.45143 -2.27939
N  -1.124802 -0.088574 -0.688837
N  -2.439974 -0.289467 1.259653
N  -3.01164 1.28974 -0.399006
C  3.680428 -1.62466 -0.115213
C  4.368209 -2.617458 0.595632
C  3.981589 -0.267854 0.05665
C  5.347918 -2.18575 1.491903
C  4.978388 0.111035 0.940471
C  4.165609 -4.100111 0.467095
C  5.655452 -0.852666 1.666091
C  3.227928 0.849307 -0.598812
C  0.569233 -2.165386 0.506991
C  -1.41626 -0.622377 0.485766
C  -1.947767 0.880691 -1.101157
C  -3.188694 0.668941 0.745378
C  -0.528932 1.025403 -3.045499
C  -2.478619 2.537635 -2.803576
C  3.44898 2.705623 -2.000548
C  -5.101779 1.988302 0.973812
C  -6.149026 2.246172 2.033865
H  5.887213 -2.932152 2.060343
H  5.220624 1.157336 1.067836
H  3.128418 -4.38698 0.609411
H  4.764473 -4.607656 1.221343
H  4.479012 -4.46677 -0.508236
H  6.428577 -0.561699 2.364408
H  -0.910309 -1.981732 1.876917
H  -0.568279 -0.038702 -3.276844
H  0.402715 1.226409 -2.516578
H  -0.519953 1.572902 -3.984755
H  -3.311876 2.744037 -2.141712
H  -2.870818 2.28124 -3.789039
H  -1.876919 3.443884 -2.898185
H  3.001043 3.403225 -1.292309
H  4.259042 3.195812 -2.532867
H  2.688825 2.387107 -2.714252
H  -4.587598 2.924054 0.741462
H  -5.589101 1.638617 0.059927
H  0.47504 -0.872194 -1.081227
totalener: -2137.11863418 hartree
nucrepener: 3876.44149451 hartree
electener: -6013.56012869 hartree
twoeener: 4633.58797756 hartree
kineticenergy: 2129.63167001 hartree
xcener: -175.404582263918 hartree
chargesum: 0.0000000
charge: 0.862144 -0.161455 -0.174096 -0.163629 -0.477751 -0.433632 -0.249405 -0.376516 -0.399283 -0.231380 -0.205575 -0.156541 -0.121689 -0.433842 -0.364028 -0.448149 -0.316432 0.179187 0.187798 -0.138662 -0.202469 -0.199531 -0.085000 0.380997 0.358741 0.379262 0.393772 0.387336 -0.165343 -0.183872 -0.139838 -0.025160 0.482819 0.109202 0.116166 0.130196 0.068776 0.106560 0.130513 0.171773 0.114969 0.099127 0.096705 0.114417 0.105011 0.107672 0.111501 0.126099 0.106620 0.103885 0.108477 0.213556
qa: 0.8621 -0.1615 -0.1741 -0.1636 -0.4778 -0.4336 -0.2494 -0.3765 -0.3993 -0.2314 -0.2056 -0.1565 -0.1217 -0.4338 -0.3640 -0.4481 -0.3164 0.1792 0.1878 -0.1387 -0.2025 -0.1995 -0.0850 0.3810 0.3587 0.3793 0.3938 0.3873 -0.1653 -0.1839 -0.1398 -0.0252 0.4828 0.1092 0.1162 0.1302 0.0688 0.1066 0.1305 0.1718 0.1150 0.0991 0.0967 0.1144 0.1050 0.1077 0.1115 0.1261 0.1066 0.1039 0.1085 0.2136
va: 5.8213 1.1478 1.1311 1.1444 2.0076 2.0723 2.1383 2.1112 2.1148 2.1550 3.1064 3.1781 3.2088 2.9668 2.9783 2.9538 3.8724 3.6473 3.6021 3.9732 4.0908 3.8909 3.9417 4.1322 4.3825 4.2147 4.1229 4.3177 3.8910 3.8953 3.9038 3.9161 4.4762 1.0097 1.0189 1.0122 1.0036 1.0043 0.9996 1.0344 1.0001 1.0047 1.0036 1.0198 0.9882 0.9863 0.9932 0.9960 0.9910 1.0109 1.0105 1.0490
dispcorr: -0.030331079 hartree
energy: -2137.148965257159
dipole: 38.07187 -37.35751 0.71436 -0.29982 2.37162 2.07180 -22.27222 21.36184 -0.91038
magnitude: 2.37307 au
magnitude: 6.03187 debye
