program: Orca
programVersion: 5.0.2
elementType: S F F F O O O O O O N N N N N N C C C C C C C C C C C C C C C C C H H H H H H H H H H H H H H H H H H H
charge: 0
multiplicity: 1
keywords: wb97x-d3
keywords: def2-TZVPP
keywords: def2/J RIJCOSX
keywords: DEFGRID2
keywords: scfconv7
keywords: smallprint printgap noloewdin
keywords: NOSOSCF
formula: C17H19F3N6O6S
InChI: InChI=1S/C17H19F3N6O6S/c1-9-6-5-7-10(12(27)31-4)11(9)33(29,30)25-15(28)22-13-21-14(26(2)3)24-16(23-13)32-8-17(18,19)20/h5-7,22,25H,8H2,1-4H3
52 atoms
S  3.247377 -0.260977 -1.163215
F  -7.069202 -0.679831 0.930363
F  -7.211639 -0.284951 -1.181853
F  -7.82673 1.21881 0.236854
O  3.4524 1.134456 -0.823595
O  3.704325 -0.770099 -2.429295
O  4.009086 1.497446 2.192937
O  1.942378 0.778176 1.722658
O  1.490485 -2.694113 -1.354756
O  -4.629101 -0.168251 -0.243415
N  1.588634 -0.440813 -1.046979
N  -0.436964 -1.586188 -0.99605
N  -1.225357 2.885753 -0.238595
N  -0.787758 0.67747 -0.623522
N  -2.558964 -0.882366 -0.6168
N  -2.993777 1.402911 -0.218461
C  3.890743 -1.251633 0.177722
C  4.511994 -2.489977 -0.036647
C  3.807592 -0.694005 1.45858
C  5.005903 -3.149122 1.090631
C  4.331865 -1.375048 2.544384
C  4.722514 -3.15783 -1.36539
C  4.919353 -2.613483 2.358776
C  3.129774 0.607644 1.764229
C  0.944527 -1.63932 -1.153376
C  -1.282546 -0.543985 -0.734443
C  -1.682143 1.636934 -0.359245
C  -3.347574 0.145414 -0.361379
C  0.193957 3.152744 -0.375119
C  -2.092985 3.998861 0.068727
C  3.512801 2.791033 2.510094
C  -5.538913 0.87429 0.014563
C  -6.922306 0.260298 -0.001752
H  5.480359 -4.11209 0.953982
H  4.276605 -0.941269 3.533712
H  5.396633 -2.586858 -2.000557
H  3.793058 -3.293173 -1.909696
H  5.16773 -4.138218 -1.204709
H  5.320401 -3.155623 3.204608
H  -0.889205 -2.486484 -1.064357
H  0.572952 2.842149 -1.348827
H  0.775086 2.64808 0.396476
H  0.350162 4.224807 -0.280858
H  -2.035361 4.755318 -0.71599
H  -1.80271 4.461511 1.013891
H  -3.119863 3.661405 0.150023
H  3.0935 3.273187 1.626577
H  2.753956 2.75522 3.292082
H  4.369219 3.361327 2.858498
H  -5.357856 1.338773 0.98774
H  -5.485527 1.658649 -0.744894
H  1.037298 0.379143 -0.771883
totalener: -2137.11920790 hartree
nucrepener: 3860.11007895 hartree
electener: -5997.22928684 hartree
twoeener: 4617.24153385 hartree
kineticenergy: 2129.61496383 hartree
xcener: -175.401303263829 hartree
chargesum: -0.0000000
charge: 0.858405 -0.162843 -0.162814 -0.173691 -0.476007 -0.430910 -0.245446 -0.375648 -0.401642 -0.230949 -0.209641 -0.157958 -0.121123 -0.440413 -0.365990 -0.447109 -0.301286 0.166665 0.188246 -0.138137 -0.198523 -0.199242 -0.087972 0.371703 0.364587 0.382260 0.392663 0.387038 -0.174777 -0.185248 -0.141864 -0.024928 0.482775 0.109231 0.115067 0.106058 0.131968 0.068744 0.130723 0.172496 0.112576 0.110718 0.095532 0.106186 0.107869 0.114380 0.107676 0.111770 0.126750 0.107630 0.104226 0.220219
qa: 0.8584 -0.1628 -0.1628 -0.1737 -0.4760 -0.4309 -0.2454 -0.3756 -0.4016 -0.2309 -0.2096 -0.1580 -0.1211 -0.4404 -0.3660 -0.4471 -0.3013 0.1667 0.1882 -0.1381 -0.1985 -0.1992 -0.0880 0.3717 0.3646 0.3823 0.3927 0.3870 -0.1748 -0.1852 -0.1419 -0.0249 0.4828 0.1092 0.1151 0.1061 0.1320 0.0687 0.1307 0.1725 0.1126 0.1107 0.0955 0.1062 0.1079 0.1144 0.1077 0.1118 0.1267 0.1076 0.1042 0.2202
va: 5.8244 1.1461 1.1455 1.1316 2.0088 2.0774 2.1389 2.1138 2.1115 2.1545 3.1114 3.1768 3.2122 2.9648 2.9764 2.9553 3.8682 3.6660 3.6107 3.9693 4.0887 3.8908 3.9413 4.1466 4.3767 4.2090 4.1243 4.3185 3.8848 3.8943 3.8985 3.9174 4.4761 1.0098 1.0173 1.0045 1.0115 1.0037 0.9995 1.0343 0.9997 1.0087 1.0032 0.9876 0.9865 1.0202 0.9925 0.9931 0.9964 1.0097 1.0115 1.0365
dispcorr: -0.030055781 hartree
energy: -2137.149263678882
dipole: 42.88327 -42.39711 0.48616 13.67221 -11.90448 1.76773 7.66773 -5.96759 1.70014
magnitude: 2.50034 au
magnitude: 6.35536 debye
