program: Orca
programVersion: 5.0.2
elementType: S F F F O O O O O O N N N N N N C C C C C C C C C C C C C C C C C H H H H H H H H H H H H H H H H H H H
charge: 0
multiplicity: 1
keywords: wb97x-d3
keywords: def2-TZVPP
keywords: def2/J RIJCOSX
keywords: DEFGRID2
keywords: scfconv7
keywords: smallprint printgap noloewdin
keywords: NOSOSCF
formula: C17H19F3N6O6S
InChI: InChI=1S/C17H19F3N6O6S/c1-9-6-5-7-10(12(27)31-4)11(9)33(29,30)25-15(28)22-13-21-14(26(2)3)24-16(23-13)32-8-17(18,19)20/h5-7,22,25H,8H2,1-4H3
52 atoms
S  2.129501 -2.705595 -0.738175
F  -5.812729 3.452883 2.323835
F  -4.163028 4.729144 1.797067
F  -4.410121 4.075835 3.840602
O  2.015658 -2.40767 -2.15371
O  2.287099 -4.066958 -0.298508
O  3.254663 0.451318 -2.778846
O  1.501949 0.481572 -1.392181
O  1.312833 -2.116166 2.101353
O  -3.791453 2.160092 0.959874
N  0.723385 -2.063043 -0.09786
N  -0.520556 -0.943337 1.515313
N  -2.374147 -0.196051 -2.62911
N  -1.441832 -0.611218 -0.586386
N  -2.169569 0.606112 1.291254
N  -3.13105 1.020705 -0.824229
C  3.428738 -1.676749 -0.066116
C  4.301346 -2.135361 0.929739
C  3.588029 -0.412109 -0.645179
C  5.320794 -1.266616 1.322786
C  4.628386 0.406711 -0.237946
C  4.248639 -3.477919 1.600746
C  5.490492 -0.020921 0.755573
C  2.638816 0.185486 -1.639716
C  0.571933 -1.755079 1.22228
C  -1.403154 -0.300173 0.691309
C  -2.321436 0.085813 -1.324779
C  -2.99855 1.222309 0.464815
C  -1.47639 -1.184642 -3.19226
C  -3.25619 0.509916 -3.530341
C  2.476959 1.065195 -3.798919
C  -3.654801 2.487012 2.322609
C  -4.525583 3.700065 2.56091
H  6.002465 -1.593076 2.097296
H  4.760467 1.380067 -0.690564
H  3.274662 -3.678996 2.036371
H  4.989002 -3.507345 2.398334
H  4.473472 -4.285672 0.907541
H  6.298627 0.61881 1.084014
H  -0.577119 -0.677529 2.487138
H  -1.593152 -2.155652 -2.71178
H  -0.431635 -0.883233 -3.104863
H  -1.7119 -1.301093 -4.247334
H  -3.89259 -0.195699 -4.06659
H  -2.681898 1.080552 -4.263307
H  -3.885509 1.195532 -2.973837
H  3.153433 1.223202 -4.633842
H  1.659606 0.416178 -4.113632
H  2.064848 2.020877 -3.474148
H  -3.980034 1.669786 2.97182
H  -2.621469 2.729049 2.582518
H  0.072616 -1.619894 -0.758025
totalener: -2137.11784936 hartree
nucrepener: 3911.34830606 hartree
electener: -6048.46615542 hartree
twoeener: 4668.54701250 hartree
kineticenergy: 2129.64304447 hartree
xcener: -175.405288832153 hartree
chargesum: 0.0000000
charge: 0.864030 -0.164253 -0.163948 -0.172856 -0.475717 -0.434025 -0.248576 -0.377895 -0.396874 -0.235360 -0.206063 -0.167891 -0.115024 -0.432569 -0.437911 -0.375671 -0.334751 0.187273 0.198429 -0.142976 -0.208455 -0.195991 -0.082846 0.386396 0.353140 0.372600 0.413889 0.386779 -0.164605 -0.183990 -0.137196 -0.029588 0.483392 0.108546 0.116497 0.126733 0.068513 0.108183 0.131431 0.167142 0.115399 0.095001 0.096892 0.100757 0.103805 0.127381 0.125085 0.107907 0.110592 0.111350 0.106800 0.211089
qa: 0.8640 -0.1643 -0.1639 -0.1729 -0.4757 -0.4340 -0.2486 -0.3779 -0.3969 -0.2354 -0.2061 -0.1679 -0.1150 -0.4326 -0.4379 -0.3757 -0.3348 0.1873 0.1984 -0.1430 -0.2085 -0.1960 -0.0828 0.3864 0.3531 0.3726 0.4139 0.3868 -0.1646 -0.1840 -0.1372 -0.0296 0.4834 0.1085 0.1165 0.1267 0.0685 0.1082 0.1314 0.1671 0.1154 0.0950 0.0969 0.1008 0.1038 0.1274 0.1251 0.1079 0.1106 0.1114 0.1068 0.2111
va: 5.8155 1.1439 1.1435 1.1329 2.0107 2.0710 2.1398 2.1093 2.1155 2.1504 3.1028 3.1796 3.1945 2.9687 2.9427 2.9849 3.8716 3.6291 3.5899 3.9804 4.0935 3.8883 3.9360 4.1268 4.3872 4.2529 4.0672 4.3106 3.8959 3.8807 3.9058 3.9176 4.4676 1.0099 1.0183 1.0129 1.0034 1.0041 0.9993 1.0367 0.9985 0.9981 1.0039 0.9882 0.9868 1.0255 0.9956 0.9890 0.9934 1.0094 1.0137 1.0555
dispcorr: -0.030538987 hartree
energy: -2137.148388349489
dipole: 27.86875 -27.15722 0.71154 -18.13330 19.05166 0.91836 -24.82391 24.00185 -0.82205
magnitude: 1.42318 au
magnitude: 3.61744 debye
