program: Orca
programVersion: 5.0.2
elementType: S F F F O O O O O O N N N N N N C C C C C C C C C C C C C C C C C H H H H H H H H H H H H H H H H H H H
charge: 0
multiplicity: 1
keywords: wb97x-d3
keywords: def2-TZVPP
keywords: def2/J RIJCOSX
keywords: DEFGRID2
keywords: scfconv7
keywords: smallprint printgap noloewdin
keywords: NOSOSCF
formula: C17H19F3N6O6S
InChI: InChI=1S/C17H19F3N6O6S/c1-9-6-5-7-10(12(27)31-4)11(9)33(29,30)25-15(28)22-13-21-14(26(2)3)24-16(23-13)32-8-17(18,19)20/h5-7,22,25H,8H2,1-4H3
52 atoms
S  2.233067 -2.31673 -0.835845
F  -6.814829 2.140996 2.030868
F  -5.500934 3.788437 2.464357
F  -5.98918 2.366544 4.01222
O  2.256143 -1.895325 -2.222777
O  2.146596 -3.714954 -0.505232
O  4.024843 0.657931 -2.633555
O  2.215475 0.953807 -1.352036
O  1.154295 -2.073502 1.979093
O  -4.32315 1.776439 0.972197
N  0.904801 -1.51537 -0.217122
N  -0.614488 -0.810292 1.391853
N  -1.947398 0.736282 -2.731916
N  -1.243475 -0.043785 -0.704392
N  -2.484253 0.469364 1.229528
N  -3.181076 1.296616 -0.867863
C  3.638989 -1.567435 -0.028936
C  4.359954 -2.227581 0.974777
C  4.058368 -0.328373 -0.5302
C  5.495937 -1.579106 1.46364
C  5.207164 0.26333 -0.032651
C  4.042913 -3.578528 1.550053
C  5.920213 -0.36121 0.975171
C  3.296136 0.468959 -1.545978
C  0.545391 -1.522498 1.097546
C  -1.468796 -0.105535 0.590889
C  -2.135875 0.670263 -1.412344
C  -3.286934 1.154085 0.431548
C  -0.802362 0.083825 -3.336501
C  -2.83807 1.476552 -3.596171
C  3.432518 1.415279 -3.680435
C  -4.526248 1.640258 2.358982
C  -5.724045 2.49725 2.706512
H  6.065726 -2.063557 2.245664
H  5.541939 1.213024 -0.427364
H  3.021237 -3.645335 1.909938
H  4.711734 -3.774728 2.386353
H  4.187197 -4.369848 0.817009
H  6.813946 0.100904 1.372373
H  -0.852179 -0.809861 2.372502
H  0.137936 0.501633 -2.975898
H  -0.855052 0.230728 -4.412628
H  -0.796183 -0.989124 -3.144203
H  -3.252326 0.820586 -4.363682
H  -2.304185 2.290115 -4.090934
H  -3.653621 1.896477 -3.018274
H  2.528737 0.931498 -4.050913
H  3.187785 2.428006 -3.359775
H  4.171842 1.453292 -4.47516
H  -4.727786 0.602703 2.637982
H  -3.661416 1.978487 2.934819
H  0.358095 -0.932011 -0.861259
totalener: -2137.11966470 hartree
nucrepener: 3857.82102349 hartree
electener: -5994.94068819 hartree
twoeener: 4614.99510257 hartree
kineticenergy: 2129.63701578 hartree
xcener: -175.405450991088 hartree
chargesum: -0.0000000
charge: 0.859522 -0.163175 -0.164661 -0.172509 -0.475602 -0.432179 -0.248720 -0.373538 -0.402540 -0.234511 -0.206523 -0.164743 -0.118343 -0.437151 -0.441999 -0.375361 -0.298638 0.168737 0.180759 -0.138880 -0.199999 -0.201182 -0.085439 0.374748 0.363046 0.372094 0.408909 0.387859 -0.171378 -0.185962 -0.137787 -0.030411 0.483356 0.109468 0.116138 0.130712 0.069002 0.107027 0.130679 0.167662 0.104844 0.095914 0.112068 0.102498 0.104227 0.127814 0.105934 0.112156 0.125450 0.110016 0.108940 0.221651
qa: 0.8595 -0.1632 -0.1647 -0.1725 -0.4756 -0.4322 -0.2487 -0.3735 -0.4025 -0.2345 -0.2065 -0.1647 -0.1183 -0.4372 -0.4420 -0.3754 -0.2986 0.1687 0.1808 -0.1389 -0.2000 -0.2012 -0.0854 0.3747 0.3630 0.3721 0.4089 0.3879 -0.1714 -0.1860 -0.1378 -0.0304 0.4834 0.1095 0.1161 0.1307 0.0690 0.1070 0.1307 0.1677 0.1048 0.0959 0.1121 0.1025 0.1042 0.1278 0.1059 0.1122 0.1255 0.1100 0.1089 0.2217
va: 5.8266 1.1451 1.1427 1.1332 2.0094 2.0764 2.1367 2.1175 2.1115 2.1510 3.1156 3.1788 3.2065 2.9669 2.9434 2.9824 3.8623 3.6605 3.6188 3.9708 4.0871 3.8927 3.9434 4.1414 4.3811 4.2495 4.0663 4.3089 3.8900 3.8799 3.9019 3.9169 4.4683 1.0098 1.0188 1.0125 1.0035 1.0040 0.9997 1.0367 1.0081 1.0032 1.0002 0.9876 0.9867 1.0256 0.9927 0.9929 0.9959 1.0109 1.0120 1.0358
dispcorr: -0.029653547 hartree
energy: -2137.149318250116
dipole: 37.07539 -35.94312 1.13227 -9.53619 10.55706 1.02087 -25.44306 24.69108 -0.75198
magnitude: 1.69991 au
magnitude: 4.32082 debye
