program: Orca
programVersion: 5.0.2
elementType: S F F F O O O O O O N N N N N N C C C C C C C C C C C C C C C C C H H H H H H H H H H H H H H H H H H H
charge: 0
multiplicity: 1
keywords: wb97x-d3
keywords: def2-TZVPP
keywords: def2/J RIJCOSX
keywords: DEFGRID2
keywords: scfconv7
keywords: smallprint printgap noloewdin
keywords: NOSOSCF
formula: C17H19F3N6O6S
InChI: InChI=1S/C17H19F3N6O6S/c1-9-6-5-7-10(12(27)31-4)11(9)33(29,30)25-15(28)22-13-21-14(26(2)3)24-16(23-13)32-8-17(18,19)20/h5-7,22,25H,8H2,1-4H3
52 atoms
S  2.241547 -1.978435 -1.238214
F  -6.614485 3.239468 1.404855
F  -4.478467 3.026769 1.64368
F  -5.797057 2.408999 3.221189
O  2.204771 -1.049541 -2.351814
O  2.247467 -3.398178 -1.476574
O  3.852479 1.449613 -1.867757
O  2.070559 1.287093 -0.523017
O  1.169634 -2.932231 1.433915
O  -4.747691 0.221053 1.718145
N  0.883229 -1.55915 -0.362446
N  -0.716683 -1.704269 1.313959
N  -2.127013 1.287421 -1.888946
N  -1.387497 -0.204369 -0.325289
N  -2.749912 -0.721505 1.529353
N  -3.508046 0.795659 -0.107418
C  3.614776 -1.512236 -0.199554
C  4.377544 -2.454978 0.50265
C  3.946962 -0.152964 -0.188138
C  5.456884 -1.965836 1.240111
C  5.039825 0.283072 0.541477
C  4.16186 -3.941427 0.503512
C  5.787067 -0.626627 1.267898
C  3.151286 0.911063 -0.884209
C  0.513578 -2.129286 0.820908
C  -1.645822 -0.839205 0.804908
C  -2.351393 0.618864 -0.755491
C  -3.628701 0.113269 1.006712
C  -0.875471 1.108456 -2.600086
C  -3.064383 2.253435 -2.413361
C  3.218606 2.475581 -2.619867
C  -5.77186 1.073012 1.268064
C  -5.651435 2.449423 1.896745
H  6.056837 -2.671216 1.800094
H  5.304066 1.33196 0.546017
H  3.148333 -4.213579 0.779792
H  4.843525 -4.400047 1.217694
H  4.365462 -4.374064 -0.474317
H  6.636121 -0.290119 1.847482
H  -0.977487 -2.134116 2.189526
H  -0.927483 1.672285 -3.528693
H  -0.698579 0.063889 -2.854185
H  -0.025195 1.468361 -2.020643
H  -3.419333 1.949307 -3.399917
H  -2.588661 3.23126 -2.505634
H  -3.916244 2.347731 -1.750018
H  2.323382 2.099718 -3.115717
H  2.94934 3.3287 -1.996512
H  3.941617 2.785193 -3.369022
H  -5.779331 1.172489 0.182203
H  -6.713497 0.625706 1.588933
H  0.293948 -0.806914 -0.737978
totalener: -2137.11787141 hartree
nucrepener: 3903.77846046 hartree
electener: -6040.89633187 hartree
twoeener: 4661.18968161 hartree
kineticenergy: 2129.64076031 hartree
xcener: -175.407100426961 hartree
chargesum: -0.0000000
charge: 0.857292 -0.175857 -0.164406 -0.164817 -0.478549 -0.431385 -0.245581 -0.371497 -0.401386 -0.246144 -0.211686 -0.157652 -0.123195 -0.440495 -0.363986 -0.441704 -0.284363 0.157802 0.180378 -0.138321 -0.196366 -0.200339 -0.088220 0.369985 0.366238 0.379074 0.393818 0.399379 -0.187063 -0.182844 -0.140013 -0.036355 0.473130 0.108716 0.114931 0.130553 0.068813 0.106614 0.131039 0.172360 0.095654 0.109834 0.123729 0.105229 0.107404 0.115053 0.104921 0.112518 0.125515 0.109038 0.130888 0.222318
qa: 0.8573 -0.1759 -0.1644 -0.1648 -0.4785 -0.4314 -0.2456 -0.3715 -0.4014 -0.2461 -0.2117 -0.1577 -0.1232 -0.4405 -0.3640 -0.4417 -0.2844 0.1578 0.1804 -0.1383 -0.1964 -0.2003 -0.0882 0.3700 0.3662 0.3791 0.3938 0.3994 -0.1871 -0.1828 -0.1400 -0.0364 0.4731 0.1087 0.1149 0.1306 0.0688 0.1066 0.1310 0.1724 0.0957 0.1098 0.1237 0.1052 0.1074 0.1151 0.1049 0.1125 0.1255 0.1090 0.1309 0.2223
va: 5.8261 1.1292 1.1372 1.1426 2.0038 2.0775 2.1370 2.1217 2.1131 2.1544 3.1085 3.1743 3.2196 2.9678 2.9721 2.9390 3.8610 3.6763 3.6280 3.9696 4.0888 3.8929 3.9416 4.1501 4.3780 4.2149 4.1139 4.2979 3.8809 3.8982 3.9018 3.9236 4.4293 1.0099 1.0167 1.0125 1.0038 1.0036 0.9993 1.0343 1.0021 1.0027 1.0080 0.9870 0.9875 1.0191 0.9921 0.9928 0.9968 1.0212 1.0055 1.0356
dispcorr: -0.030661849 hartree
energy: -2137.148533262434
dipole: 31.51091 -31.44504 0.06587 -4.33889 5.84891 1.51002 -21.04312 20.15115 -0.89197
magnitude: 1.75502 au
magnitude: 4.46091 debye
