program: Orca
programVersion: 5.0.2
elementType: S F F F O O O O O O N N N N N N C C C C C C C C C C C C C C C C C H H H H H H H H H H H H H H H H H H H
charge: 0
multiplicity: 1
keywords: wb97x-d3
keywords: def2-TZVPP
keywords: def2/J RIJCOSX
keywords: DEFGRID2
keywords: scfconv7
keywords: smallprint printgap noloewdin
keywords: NOSOSCF
formula: C17H19F3N6O6S
InChI: InChI=1S/C17H19F3N6O6S/c1-9-6-5-7-10(12(27)31-4)11(9)33(29,30)25-15(28)22-13-21-14(26(2)3)24-16(23-13)32-8-17(18,19)20/h5-7,22,25H,8H2,1-4H3
52 atoms
S  2.19907 -1.983084 -1.34514
F  -5.321306 2.630766 3.435191
F  -6.21281 3.515957 1.677817
F  -4.096491 3.09799 1.734038
O  2.133929 -1.028362 -2.435728
O  2.248473 -3.395021 -1.622437
O  3.690592 1.562597 -1.799314
O  1.896147 1.224822 -0.506213
O  1.218999 -2.951365 1.35819
O  -4.618312 0.337764 1.900052
N  0.831605 -1.628875 -0.457353
N  -0.69022 -1.751929 1.290626
N  -2.254432 1.11371 -1.949957
N  -1.444942 -0.315122 -0.365605
N  -2.680317 -0.700978 1.604768
N  -3.511374 0.763916 -0.045696
C  3.557479 -1.506511 -0.290748
C  4.357083 -2.450242 0.367667
C  3.841325 -0.137679 -0.22447
C  5.425944 -1.954931 1.115727
C  4.925777 0.305171 0.514017
C  4.186749 -3.941693 0.317347
C  5.710803 -0.607458 1.195387
C  3.001471 0.92702 -0.865552
C  0.524276 -2.174218 0.754496
C  -1.634891 -0.886955 0.810831
C  -2.413444 0.51542 -0.767248
C  -3.566161 0.14341 1.109254
C  -1.058282 0.859555 -2.730298
C  -3.200739 2.077573 -2.460586
C  3.018237 2.605424 -2.492346
C  -5.598551 1.271826 1.521076
C  -5.292337 2.640816 2.10238
H  6.054241 -2.661442 1.642139
H  5.154107 1.361377 0.560728
H  3.18915 -4.252169 0.612105
H  4.900747 -4.405086 0.995957
H  4.373715 -4.334129 -0.680113
H  6.553714 -0.266121 1.780931
H  -0.897693 -2.143322 2.197871
H  -0.932413 -0.201043 -2.945711
H  -0.161461 1.214471 -2.221467
H  -1.1505 1.383632 -3.67862
H  -2.711413 3.038426 -2.628276
H  -4.007007 2.222441 -1.750934
H  -3.623831 1.736931 -3.407359
H  3.74035 3.00965 -3.195814
H  2.158171 2.2187 -3.039567
H  2.684606 3.393153 -1.816336
H  -5.697547 1.351679 0.438153
H  -6.543116 0.919253 1.937389
H  0.202518 -0.905283 -0.827239
totalener: -2137.11763754 hartree
nucrepener: 3918.98111146 hartree
electener: -6056.09874900 hartree
twoeener: 4676.45341158 hartree
kineticenergy: 2129.64331143 hartree
xcener: -175.407715296869 hartree
chargesum: -0.0000000
charge: 0.857610 -0.164516 -0.175348 -0.164705 -0.479036 -0.433607 -0.247189 -0.369817 -0.400561 -0.246115 -0.208587 -0.157000 -0.124153 -0.437752 -0.363408 -0.442100 -0.293724 0.166690 0.181070 -0.138008 -0.197687 -0.200179 -0.088088 0.370570 0.363313 0.377775 0.397113 0.398110 -0.173920 -0.183308 -0.139455 -0.036345 0.473295 0.108848 0.115397 0.129305 0.068445 0.106852 0.130867 0.171950 0.109952 0.111489 0.095753 0.107272 0.114982 0.105705 0.125382 0.105595 0.112133 0.109808 0.129913 0.219413
qa: 0.8576 -0.1645 -0.1753 -0.1647 -0.4790 -0.4336 -0.2472 -0.3698 -0.4006 -0.2461 -0.2086 -0.1570 -0.1242 -0.4378 -0.3634 -0.4421 -0.2937 0.1667 0.1811 -0.1380 -0.1977 -0.2002 -0.0881 0.3706 0.3633 0.3778 0.3971 0.3981 -0.1739 -0.1833 -0.1395 -0.0363 0.4733 0.1088 0.1154 0.1293 0.0684 0.1069 0.1309 0.1720 0.1100 0.1115 0.0958 0.1073 0.1150 0.1057 0.1254 0.1056 0.1121 0.1098 0.1299 0.2194
va: 5.8247 1.1428 1.1299 1.1369 2.0036 2.0739 2.1362 2.1204 2.1152 2.1551 3.1072 3.1758 3.2195 2.9684 2.9736 2.9385 3.8678 3.6624 3.6245 3.9697 4.0896 3.8925 3.9434 4.1471 4.3817 4.2175 4.1096 4.2996 3.8890 3.8992 3.9025 3.9264 4.4280 1.0098 1.0176 1.0119 1.0038 1.0042 0.9994 1.0344 1.0021 1.0063 1.0031 0.9873 1.0183 0.9870 0.9961 0.9926 0.9932 1.0202 1.0059 1.0415
dispcorr: -0.030790815 hartree
energy: -2137.148428356938
dipole: 28.61536 -28.73001 -0.11466 -5.56815 7.07780 1.50965 -22.05968 21.22909 -0.83058
magnitude: 1.72686 au
magnitude: 4.38933 debye
