program: Orca
programVersion: 5.0.2
elementType: S F F F O O O O O O N N N N N N C C C C C C C C C C C C C C C C C H H H H H H H H H H H H H H H H H H H
charge: 0
multiplicity: 1
keywords: wb97x-d3
keywords: def2-TZVPP
keywords: def2/J RIJCOSX
keywords: DEFGRID2
keywords: scfconv7
keywords: smallprint printgap noloewdin
keywords: NOSOSCF
formula: C17H19F3N6O6S
InChI: InChI=1S/C17H19F3N6O6S/c1-9-6-5-7-10(12(27)31-4)11(9)33(29,30)25-15(28)22-13-21-14(26(2)3)24-16(23-13)32-8-17(18,19)20/h5-7,22,25H,8H2,1-4H3
52 atoms
S  1.936311 -2.458238 -0.598178
F  -4.565955 4.291445 2.177474
F  -2.631435 3.364915 2.251352
F  -3.733948 3.695012 4.07972
O  1.691491 -2.385803 -2.026008
O  2.078062 -3.735198 0.049695
O  3.02941 0.126126 -3.292719
O  1.422659 0.580965 -1.803656
O  1.287568 -1.638557 2.23577
O  -4.612764 1.585803 1.351317
N  0.630575 -1.646795 0.053277
N  -0.676348 -0.671222 1.704568
N  -2.778754 -0.216122 -2.365078
N  -1.697509 -0.462684 -0.368497
N  -2.648827 0.446233 1.5819
N  -3.745184 0.707159 -0.487873
C  3.344432 -1.418988 -0.239044
C  4.288037 -1.754624 0.741148
C  3.51536 -0.296935 -1.058687
C  5.386558 -0.903111 0.874089
C  4.633539 0.505509 -0.905319
C  4.239767 -2.956174 1.641377
C  5.56481 0.205392 0.072901
C  2.511459 0.155483 -2.075899
C  0.489771 -1.357773 1.377809
C  -1.706142 -0.220981 0.926141
C  -2.749475 0.018552 -1.051328
C  -3.620801 0.888115 0.803916
C  -1.682926 -0.921797 -2.99972
C  -3.829737 0.299609 -3.212263
C  2.183063 0.536292 -4.35841
C  -4.50958 1.985089 2.696147
C  -3.849664 3.349377 2.792141
H  6.125143 -1.134606 1.630424
H  4.773564 1.366997 -1.544077
H  5.055424 -2.895533 2.359877
H  4.35695 -3.882549 1.08297
H  3.306922 -3.019963 2.192708
H  6.435325 0.834066 0.20375
H  -0.749466 -0.436237 2.683179
H  -1.517777 -1.901338 -2.552113
H  -0.75164 -0.358068 -2.941026
H  -1.933815 -1.071019 -4.047257
H  -4.300081 -0.513763 -3.767093
H  -3.427715 1.01789 -3.929807
H  -4.583637 0.794794 -2.61065
H  1.329494 -0.134753 -4.457326
H  1.820915 1.555377 -4.221406
H  2.789189 0.481812 -5.258145
H  -5.527717 2.059212 3.079903
H  -3.953251 1.269035 3.301735
H  -0.068309 -1.268058 -0.597054
totalener: -2137.11795388 hartree
nucrepener: 3935.05849417 hartree
electener: -6072.17644806 hartree
twoeener: 4692.62126217 hartree
kineticenergy: 2129.64810787 hartree
xcener: -175.408097133559 hartree
chargesum: 0.0000000
charge: 0.859013 -0.166250 -0.163753 -0.173001 -0.475625 -0.433015 -0.247757 -0.372917 -0.402675 -0.250734 -0.206611 -0.168003 -0.118039 -0.436653 -0.437970 -0.372516 -0.301550 0.168188 0.186313 -0.138999 -0.200997 -0.200897 -0.085985 0.372878 0.362838 0.380725 0.409453 0.390869 -0.175611 -0.184365 -0.141575 -0.032311 0.471178 0.108944 0.116306 0.068491 0.106437 0.131412 0.130969 0.168359 0.110408 0.109529 0.096236 0.100195 0.105245 0.126904 0.107707 0.113286 0.126362 0.127389 0.112205 0.219970
qa: 0.8590 -0.1662 -0.1638 -0.1730 -0.4756 -0.4330 -0.2478 -0.3729 -0.4027 -0.2507 -0.2066 -0.1680 -0.1180 -0.4367 -0.4380 -0.3725 -0.3016 0.1682 0.1863 -0.1390 -0.2010 -0.2009 -0.0860 0.3729 0.3628 0.3807 0.4095 0.3909 -0.1756 -0.1844 -0.1416 -0.0323 0.4712 0.1089 0.1163 0.0685 0.1064 0.1314 0.1310 0.1684 0.1104 0.1095 0.0962 0.1002 0.1052 0.1269 0.1077 0.1133 0.1264 0.1274 0.1122 0.2200
va: 5.8257 1.1396 1.1387 1.1336 2.0088 2.0753 2.1381 2.1164 2.1117 2.1527 3.1147 3.1919 3.2057 2.9715 2.9247 2.9770 3.8664 3.6626 3.6103 3.9708 4.0891 3.8915 3.9411 4.1439 4.3805 4.2303 4.0692 4.3028 3.8875 3.8801 3.8973 3.9138 4.4318 1.0098 1.0180 1.0038 1.0047 1.0117 0.9994 1.0360 1.0015 1.0096 1.0026 0.9885 0.9867 1.0259 0.9925 0.9934 0.9961 1.0051 1.0302 1.0384
dispcorr: -0.030524741 hartree
energy: -2137.148478625176
dipole: 19.93383 -19.95245 -0.01861 -17.12985 17.90182 0.77197 -26.75729 25.77490 -0.98239
magnitude: 1.24955 au
magnitude: 3.17610 debye
