program: Gaussian 09
title: 000074010
version: EM64L-G09RevD.01
frameworkgroup: C1[X(C11H14O)]
method: RPBEPBE
basis: SDD
operation: Freq
keyword: #pfreq=noraman
keyword: PBEPBE/SDD
title: #p freq=noraman PBEPBE/SDD
converged: YES YES NO NO
title: Mulliken charges:
elementType: O C C C C C C C C C C C H H H H H H H H H H H H H H
charge: -0.179820 -0.240768 0.545945 -0.512350 -0.686858 -0.695711 0.493700 -0.474794 -0.451345 -0.210735 -0.635010 -0.039550 0.204791 0.237293 0.222256 0.207595 0.227239 0.224638 0.212612 0.211441 0.234710 0.228380 0.223651 0.244698 0.240776 0.167217
chargesum: 0.00000
title: Mulliken charges with hydrogens summed into heavy atoms:
elementType: O C C C C C C C C C C C
charge: -0.179820 -0.035977 0.545945 -0.275057 -0.029768 -0.047020 0.493700 -0.240084 -0.222966 0.012916 -0.149536 0.127667
polarizability: 1.43024612e+02 -4.21437758e+00 1.26068364e+02 -8.86912348e+00 -5.36373898e+00 8.24679614e+01
1716.lowfreq: -13.8699 -9.5182 -2.8681 0.0008 0.0009 0.0011 24.7147 37.6492 80.8158
frequency: 24.4464 37.5168 80.7906 105.6726 127.8811 179.3633 212.4954 237.1933 246.8634 294.7065 313.1775 332.5352 443.4872 456.8023 480.6722 553.3544 570.3419 681.0197 699.9776 714.3407 750.5689 805.9393 846.5109 897.7675 904.7028 908.1088 918.5315 954.3004 958.2453 978.2454 989.4727 1001.3017 1075.0177 1090.8602 1113.6447 1142.0723 1179.0982 1180.3925 1190.1812 1240.1070 1281.4300 1309.7226 1318.0406 1341.4846 1374.9272 1385.0378 1389.2931 1394.7554 1427.4055 1444.2318 1465.8284 1467.8665 1477.5403 1478.5735 1489.5423 1597.5767 1617.4936 1655.6140 2847.3470 2938.1606 2973.8112 2976.5998 2979.4099 3008.0850 3067.1281 3074.1490 3076.8084 3082.2231 3112.9056 3121.4371 3133.1722 3150.5986
redmass: 3.6826 3.5610 4.7735 2.4467 3.1881 2.5107 1.0455 2.7650 1.2467 2.6480 3.2308 2.6255 2.9561 2.9301 5.1264 2.9024 3.6013 4.1226 2.0961 1.5565 3.3510 1.6758 3.0702 2.6455 1.4582 1.4108 1.2068 1.4542 2.4140 1.3571 4.4288 1.9987 1.5249 1.8103 2.5863 1.7590 1.4349 1.1455 1.3240 1.7870 1.5056 1.3284 2.0929 1.5354 1.1937 3.1754 1.2655 1.3190 1.2147 2.2006 1.0459 1.0504 1.5339 1.2218 1.2372 6.1382 6.0792 7.5347 1.0840 1.0677 1.0348 1.0393 1.0798 1.0899 1.1001 1.0995 1.1005 1.0996 1.0860 1.0918 1.0913 1.0990
irintensity: 2.2519 1.7413 5.2946 6.4583 0.9240 1.3450 0.0197 2.0985 0.8917 0.5188 0.5170 1.1306 6.0356 0.9749 11.7258 0.1659 1.4519 3.9607 13.2746 20.3839 18.1412 24.0616 3.5126 9.4746 6.1377 0.7567 2.9089 0.1383 24.6307 0.4253 0.2236 1.5108 10.2134 14.2003 1.3391 1.8777 2.7404 1.7097 2.8208 4.7930 19.6634 0.3091 24.8458 1.4843 15.2413 8.2660 12.1727 7.8763 17.2691 16.4166 4.1057 1.4891 2.6418 15.0472 27.5914 8.6606 17.4754 101.9325 192.6695 46.2634 32.3478 33.2608 19.9772 14.4841 3.4975 95.2637 28.5249 37.0414 0.0343 30.0253 15.5422 26.0627
temp: 298.150 k
press: 1.00000 atm
elementType: 8 6 6 6 6 6 6 6 6 6 6 6 1 1 1 1 1 1 1 1 1 1 1 1 1 1
symmnumber: 1
zpe: 570474.6 jmol-1
zpe.correction: 0.217282 hartree
zpe.thermalcorrener: 0.229796 hartree
zpe.thermalcorrenthalpy: 0.230740 hartree
zpe.thermalcorrgfe: 0.177197 hartree
zpe.sumelectzpe: -501.885931 hartree
zpe.sumelectthermal: -501.873417 hartree
zpe.sumelectthermalent: -501.872472 hartree
zpe.sumelectthermalfe: -501.926016 hartree
dipole: -0.8497 1.3524 1.8985
dipole: 2.4810
quadrupole: -59.3530 -73.5386 -75.6800
quadrupole: -2.7186 -6.1174 -5.7561
quadrupole: 10.1709 -4.0148 -6.1561 -2.7186 -6.1174 -5.7561
hfenergy: -502.1032129 hartree
pointgroup: C01 [X(C11H14O1)]
dipole: -0.2867048 0.5284102 0.7689719 debye
dipolederiv: -0.4582941 0.0360707 0.1670385 -0.0753786 -0.6061567 -0.2180051 0.0329167 -0.2971613 -0.5300711 0.2037694 0.014889 -0.0107055 0.0832598 0.0598885 -0.0084688 -0.0174232 0.0000134 0.1338609 0.221988 -0.2032596 -0.0317123 -0.1923144 0.0654821 -0.0012204 -0.0454642 0.0174613 -0.0897844 -0.2317496 0.07439 0.010665 0.0173284 0.0617287 -0.0419513 0.0725639 0.0046694 -0.121609 -0.0079147 0.0414807 -0.0064045 0.0072403 -0.004532 -0.0528124 -0.0631661 -0.033105 -0.0015526 0.006439 0.0516537 -0.0404715 0.051815 0.0337129 0.0211725 0.0239896 0.0015811 -0.0426639 0.2292226 0.1335431 -0.0413496 0.082818 0.0536402 -0.078664 -0.1284629 -0.1079354 -0.0187484 -0.0723914 0.0704034 -0.0491638 0.144821 -0.0823781 -0.0558301 -0.0641044 -0.0469873 -0.1373618 -0.0663943 -0.1037662 -0.021738 -0.089177 -0.1036845 -0.0134657 0.0163504 0.0048787 -0.1696372 0.0007153 0.0080527 -0.0300249 -0.0180963 0.1096009 -0.0676592 -0.0249179 -0.0698404 -0.1020854 0.0229165 -0.1173601 -0.019271 -0.2204332 -0.2796076 -0.1988579 -0.0798268 -0.3059491 -0.0665769 0.6856477 0.2065539 -0.2292581 0.3603608 0.8526698 0.4099143 -0.1296444 0.4540259 0.5315871 -0.0682935 -0.0711162 0.0338959 -0.1250436 -0.0753995 0.0534533 0.0496561 0.0435673 -0.0027551 0.1219335 0.0078418 0.0025514 0.0155307 -0.0779223 0.0609048 0.0015183 0.0428802 0.1001356 -0.0098777 -0.1241593 0.0373542 -0.1018536 0.0017826 0.0122 0.0668536 0.0641796 0.0455085 -0.1511475 0.146965 0.0417757 0.1457598 -0.0158553 -0.047053 0.0249978 -0.0345603 0.0802594 0.0903438 0.0064452 -0.0742007 -0.003938 0.0538629 0.0855159 -0.0636934 0.0402615 -0.1328043 0.1060456 -0.0143666 -0.0163542 -0.0474461 -0.0407317 -0.1390377 -0.0228779 -0.1011859 -0.0651128 -0.1657408 0.1385132 -0.0106169 0.1515203 0.0166733 0.0167903 0.0087091 0.0036776 0.0697288 -0.0177671 -0.133759 0.0716847 -0.1012948 -0.0079283 0.0718985 0.026673 0.0311231 0.0405272 -0.0745876 -0.0872043 0.0732319 -0.0585619 0.0624575 0.0380177 0.0704246 0.0443872 0.1146883 -0.0980348 0.1068824 0.0281425 0.0827988 0.0533795 0.0157976 0.0346238 0.0070703 0.1423395 0.0756884 0.0130624 0.0115338 0.0145091 -0.1289757 0.0749891 0.0104906 0.076599 0.1296362 0.0480667 -0.0574258 -0.0191167 -0.0604466 0.0425219 0.0864554 0.0762298 0.0964002 -0.0554409 -0.0883204 0.017741 0.004006 0.0950911 0.0014766 -0.0221962 -0.0186027 0.04114 0.1285317 -0.3022629 -0.1620709 0.118508 -0.158869 -0.0457058 -0.0018878 0.1421867 0.0228092 0.0194005 unknown
polarizability: 141.4481829|-4.3053552|125.8023307|-13.4258887|-5.5216481|84.3104239 unknown
InChI: InChI=1S/C11H14O/c1-9(2)11-5-3-4-10(8-11)6-7-12/h3-5,7-9H,6H2,1-2H3
charge 0 multiplicity 1
26 atoms
O  -2.19022 -2.200252 -0.563208
C  2.568037 -0.42768 -0.177799
C  1.25163 0.34724 -0.068731
C  0.071095 -0.283457 0.398066
C  2.460596 -1.57673 -1.216695
C  3.034832 -0.972245 1.198525
C  -1.157809 0.414439 0.482715
C  1.18282 1.711326 -0.44865
C  -1.203202 1.776253 0.090997
C  -0.035451 2.422235 -0.369897
C  -2.412567 -0.270652 0.990866
C  -2.845451 -1.557731 0.286674
H  3.34237 0.279897 -0.53764
H  0.101783 -1.341021 0.684384
H  1.694683 -2.314195 -0.913774
H  3.426917 -2.10664 -1.311803
H  2.175747 -1.18982 -2.211467
H  3.137636 -0.157765 1.938181
H  4.01217 -1.480899 1.102423
H  2.312337 -1.706676 1.600577
H  2.087516 2.215667 -0.81063
H  -2.14916 2.329353 0.146727
H  -0.075453 3.475928 -0.668575
H  -2.309262 -0.552506 2.064155
H  -3.282151 0.417051 0.965371
H  -3.852943 -1.923021 0.622307
