program: Orca
programVersion: 5.0.2
elementType: S F F F O O O O O O N N N N N N C C C C C C C C C C C C C C C C C H H H H H H H H H H H H H H H H H H H
charge: 0
multiplicity: 1
keywords: wb97x-d3
keywords: def2-TZVPP
keywords: def2/J RIJCOSX
keywords: DEFGRID2
keywords: scfconv7
keywords: smallprint printgap noloewdin
keywords: NOSOSCF
formula: C17H19F3N6O6S
InChI: InChI=1S/C17H19F3N6O6S/c1-9-6-5-7-10(12(27)31-4)11(9)33(29,30)25-15(28)22-13-21-14(26(2)3)24-16(23-13)32-8-17(18,19)20/h5-7,22,25H,8H2,1-4H3
52 atoms
S  2.502818 -0.734189 -1.4848
F  -7.269371 -0.655275 0.493634
F  -6.533138 -2.4431 1.448781
F  -5.485062 -1.604367 -0.243637
O  2.690028 0.589172 -2.0480
O  2.475357 -1.88548 -2.348146
O  4.383647 2.379597 -0.239353
O  2.378316 1.870454 0.615455
O  1.010034 -2.64629 0.323345
O  -4.841088 0.674582 1.187346
N  1.044771 -0.599091 -0.676719
N  -0.795609 -1.319888 0.548412
N  -1.672849 2.840716 -1.202164
N  -1.192549 0.78241 -0.343637
N  -2.830587 -0.369367 0.893065
N  -3.312599 1.761618 0.00864
C  3.70365 -0.9529 -0.182711
C  4.285987 -2.196872 0.098237
C  4.088097 0.202532 0.506308
C  5.235189 -2.229175 1.120932
C  5.049494 0.124877 1.500094
C  4.007441 -3.485685 -0.620516
C  5.611761 -1.098654 1.816567
C  3.485635 1.557014 0.276865
C  0.481329 -1.595084 0.064795
C  -1.624476 -0.251256 0.348133
C  -2.076353 1.782728 -0.496089
C  -3.613015 0.673488 0.675454
C  -0.329136 2.878286 -1.747067
C  -2.53197 3.977881 -1.440743
C  3.951826 3.704311 -0.520295
C  -5.326072 -0.479174 1.830813
C  -6.161088 -1.299041 0.863825
H  5.692655 -3.178873 1.365518
H  5.354898 1.017758 2.028821
H  2.952537 -3.741661 -0.613473
H  4.554508 -4.291001 -0.133343
H  4.330063 -3.444579 -1.658762
H  6.355021 -1.167184 2.599557
H  -1.194892 -2.072369 1.089425
H  -0.205846 3.815875 -2.283965
H  -0.149571 2.06371 -2.449374
H  0.427904 2.828544 -0.964149
H  -2.669337 4.132092 -2.512452
H  -2.093749 4.883084 -1.01638
H  -3.501973 3.81333 -0.985005
H  3.149525 3.703661 -1.258418
H  3.60953 4.218967 0.377822
H  4.816978 4.218876 -0.928575
H  -4.522811 -1.097621 2.231413
H  -5.960828 -0.144406 2.652461
H  0.531988 0.286109 -0.762991
totalener: -2137.11822055 hartree
nucrepener: 3894.00379115 hartree
electener: -6031.12201170 hartree
twoeener: 4651.47227133 hartree
kineticenergy: 2129.62602568 hartree
xcener: -175.403659482060 hartree
chargesum: 0.0000000
charge: 0.856280 -0.166372 -0.172854 -0.165236 -0.475974 -0.430911 -0.245752 -0.369702 -0.404975 -0.251217 -0.211249 -0.169481 -0.117902 -0.441952 -0.437011 -0.372113 -0.284306 0.158995 0.178945 -0.138063 -0.196656 -0.202740 -0.088240 0.368597 0.367883 0.380920 0.407803 0.394337 -0.177383 -0.186120 -0.138669 -0.033766 0.473040 0.109201 0.115375 0.132547 0.068153 0.106908 0.130630 0.168773 0.094002 0.112306 0.113243 0.104202 0.103304 0.126624 0.108034 0.110994 0.123941 0.113496 0.126119 0.223992
qa: 0.8563 -0.1664 -0.1729 -0.1652 -0.4760 -0.4309 -0.2458 -0.3697 -0.4050 -0.2512 -0.2112 -0.1695 -0.1179 -0.4420 -0.4370 -0.3721 -0.2843 0.1590 0.1789 -0.1381 -0.1967 -0.2027 -0.0882 0.3686 0.3679 0.3809 0.4078 0.3943 -0.1774 -0.1861 -0.1387 -0.0338 0.4730 0.1092 0.1154 0.1325 0.0682 0.1069 0.1306 0.1688 0.0940 0.1123 0.1132 0.1042 0.1033 0.1266 0.1080 0.1110 0.1239 0.1135 0.1261 0.2240
va: 5.8234 1.1396 1.1335 1.1385 2.0070 2.0782 2.1361 2.1228 2.1092 2.1541 3.1150 3.1893 3.2061 2.9688 2.9298 2.9770 3.8610 3.6738 3.6376 3.9670 4.0872 3.8926 3.9416 4.1523 4.3750 4.2302 4.0704 4.2997 3.8878 3.8806 3.9019 3.9066 4.4315 1.0099 1.0167 1.0112 1.0040 1.0041 0.9995 1.0357 1.0034 0.9999 1.0057 0.9874 0.9867 1.0259 0.9923 0.9931 0.9964 1.0321 1.0046 1.0323
dispcorr: -0.030049598 hartree
energy: -2137.148270147734
dipole: 39.20628 -38.38272 0.82356 19.95281 -18.33197 1.62084 -3.96903 5.17515 1.20613
magnitude: 2.18177 au
magnitude: 5.54561 debye
