program: Orca
programVersion: 5.0.2
elementType: S F F F O O O O O O N N N N N N C C C C C C C C C C C C C C C C C H H H H H H H H H H H H H H H H H H H
charge: 0
multiplicity: 1
keywords: wb97x-d3
keywords: def2-TZVPP
keywords: def2/J RIJCOSX
keywords: DEFGRID2
keywords: scfconv7
keywords: smallprint printgap noloewdin
keywords: NOSOSCF
formula: C17H19F3N6O6S
InChI: InChI=1S/C17H19F3N6O6S/c1-9-6-5-7-10(12(27)31-4)11(9)33(29,30)25-15(28)22-13-21-14(26(2)3)24-16(23-13)32-8-17(18,19)20/h5-7,22,25H,8H2,1-4H3
52 atoms
S  3.056239 0.849324 0.284357
F  -5.466238 -0.820828 -4.253303
F  -4.470933 0.8874 -3.378496
F  -6.531581 0.492704 -2.913542
O  2.876471 1.430391 1.600975
O  3.835296 1.540327 -0.708424
O  2.700995 -0.802301 3.815091
O  1.042098 -0.823107 2.315818
O  1.935159 -0.551653 -2.148378
O  -4.713668 -0.190555 -0.837143
N  1.490081 0.651362 -0.26356
N  -0.217738 -0.223319 -1.570245
N  -2.017822 2.135859 1.943612
N  -1.082956 0.962785 0.223368
N  -2.470032 -0.220717 -1.262715
N  -3.422677 0.975165 0.531617
C  3.664223 -0.817391 0.50561
C  4.590034 -1.394376 -0.374192
C  3.243065 -1.487757 1.660599
C  5.049388 -2.673171 -0.053686
C  3.745519 -2.745975 1.949142
C  5.153427 -0.756198 -1.61139
C  4.643624 -3.34213 1.082054
C  2.198982 -0.966958 2.602127
C  1.151555 -0.062009 -1.375015
C  -1.286441 0.197346 -0.828265
C  -2.188687 1.342629 0.883658
C  -3.482138 0.202998 -0.526027
C  -0.680278 2.501836 2.36625
C  -3.133055 2.630402 2.717899
C  1.806587 -0.336425 4.817137
C  -4.922312 -0.971125 -1.98874
C  -5.351537 -0.084772 -3.142097
H  5.75775 -3.145249 -0.721826
H  3.430812 -3.262076 2.84594
H  5.790571 0.092662 -1.370967
H  4.378337 -0.405844 -2.28552
H  5.760193 -1.48687 -2.143458
H  5.032412 -4.328299 1.297619
H  -0.452672 -0.780113 -2.378344
H  -0.138555 3.037844 1.58682
H  -0.094609 1.627535 2.650688
H  -0.761521 3.157635 3.22967
H  -3.117359 3.721225 2.747049
H  -3.086042 2.258053 3.743108
H  -4.067208 2.306358 2.273061
H  1.412925 0.648218 4.56426
H  0.973571 -1.023619 4.967325
H  2.391778 -0.267224 5.729588
H  -4.032652 -1.532728 -2.274685
H  -5.727416 -1.670487 -1.759112
H  0.72901 0.945005 0.361491
totalener: -2137.11795074 hartree
nucrepener: 3919.65316357 hartree
electener: -6056.77111431 hartree
twoeener: 4677.12024631 hartree
kineticenergy: 2129.64490875 hartree
xcener: -175.407481051145 hartree
chargesum: -0.0000000
charge: 0.861539 -0.173102 -0.164997 -0.166373 -0.476076 -0.432477 -0.248635 -0.374763 -0.401325 -0.250816 -0.205875 -0.167645 -0.116830 -0.432693 -0.437065 -0.372978 -0.316731 0.178825 0.187916 -0.140960 -0.204474 -0.199756 -0.085863 0.378608 0.358921 0.376803 0.409369 0.396289 -0.165411 -0.185812 -0.138229 -0.034149 0.472560 0.109519 0.116462 0.107161 0.130027 0.068812 0.131306 0.168130 0.114221 0.097481 0.096081 0.102782 0.103296 0.126509 0.107359 0.111518 0.125146 0.113034 0.126557 0.216808
qa: 0.8615 -0.1731 -0.1650 -0.1664 -0.4761 -0.4325 -0.2486 -0.3748 -0.4013 -0.2508 -0.2059 -0.1676 -0.1168 -0.4327 -0.4371 -0.3730 -0.3167 0.1788 0.1879 -0.1410 -0.2045 -0.1998 -0.0859 0.3786 0.3589 0.3768 0.4094 0.3963 -0.1654 -0.1858 -0.1382 -0.0341 0.4726 0.1095 0.1165 0.1072 0.1300 0.0688 0.1313 0.1681 0.1142 0.0975 0.0961 0.1028 0.1033 0.1265 0.1074 0.1115 0.1251 0.1130 0.1266 0.2168
va: 5.8233 1.1334 1.1388 1.1396 2.0101 2.0747 2.1379 2.1130 2.1128 2.1534 3.1089 3.1922 3.2020 2.9707 2.9289 2.9777 3.8715 3.6468 3.6107 3.9740 4.0902 3.8908 3.9407 4.1360 4.3818 4.2359 4.0697 4.2971 3.8934 3.8814 3.9037 3.9064 4.4343 1.0097 1.0185 1.0041 1.0129 1.0034 0.9994 1.0357 0.9991 1.0051 1.0037 0.9877 0.9867 1.0259 0.9916 0.9929 0.9957 1.0321 1.0046 1.0458
dispcorr: -0.030534246 hartree
energy: -2137.148484982879
dipole: 29.01612 -29.28813 -0.27200 -0.67636 -0.57780 -1.25416 31.59917 -29.73096 1.86821
magnitude: 2.26652 au
magnitude: 5.76104 debye
