program: Orca
programVersion: 5.0.2
elementType: S F F F O O O O O O N N N N N N C C C C C C C C C C C C C C C C C H H H H H H H H H H H H H H H H H H H
charge: 0
multiplicity: 1
keywords: wb97x-d3
keywords: def2-TZVPP
keywords: def2/J RIJCOSX
keywords: DEFGRID2
keywords: scfconv7
keywords: smallprint printgap noloewdin
keywords: NOSOSCF
formula: C17H19F3N6O6S
InChI: InChI=1S/C17H19F3N6O6S/c1-9-6-5-7-10(12(27)31-4)11(9)33(29,30)25-15(28)22-13-21-14(26(2)3)24-16(23-13)32-8-17(18,19)20/h5-7,22,25H,8H2,1-4H3
52 atoms
S  2.434685 -1.591316 -1.551828
F  -5.058629 0.537271 4.321315
F  -5.393954 2.269111 3.081531
F  -3.434433 1.390932 3.179247
O  2.563319 -0.56929 -2.572959
O  2.592387 -2.980954 -1.892162
O  3.782961 2.092374 -1.362498
O  1.797066 1.485096 -0.533356
O  0.991939 -2.77448 0.817117
O  -4.784609 0.782112 0.781829
N  0.896377 -1.335696 -0.946975
N  -0.866588 -1.530318 0.554322
N  -1.932952 1.631929 -2.615987
N  -1.361294 0.053957 -1.066311
N  -2.831963 -0.40377 0.714215
N  -3.405693 1.222054 -0.891934
C  3.532098 -1.155018 -0.209806
C  4.230277 -2.123095 0.524764
C  3.744507 0.212174 0.005982
C  5.124935 -1.657075 1.490376
C  4.659554 0.626766 0.959308
C  4.125162 -3.611698 0.353594
C  5.342551 -0.313097 1.71024
C  2.974064 1.300129 -0.678226
C  0.40528 -1.94495 0.169181
C  -1.705755 -0.585563 0.032201
C  -2.247373 0.963847 -1.503567
C  -3.622255 0.517083 0.19162
C  -0.671074 1.377766 -3.283281
C  -2.812376 2.626707 -3.186599
C  3.181859 3.190842 -2.03583
C  -5.099216 0.179305 2.013608
C  -4.737621 1.111082 3.155894
H  5.669856 -2.38468 2.077487
H  4.831787 1.682055 1.121598
H  4.707105 -4.101231 1.132552
H  4.518329 -3.935061 -0.608036
H  3.100435 -3.962179 0.42555
H  6.051015 0.005428 2.462989
H  -1.198584 -1.972073 1.398629
H  0.177176 1.593193 -2.633948
H  -0.610025 2.023657 -4.155826
H  -0.589711 0.344915 -3.623067
H  -3.102569 2.34302 -4.20001
H  -2.313174 3.59637 -3.230699
H  -3.706832 2.722887 -2.581435
H  2.485958 2.846705 -2.801308
H  2.653612 3.849654 -1.346153
H  3.996311 3.733116 -2.507359
H  -6.17773 0.015899 2.019221
H  -4.594197 -0.77755 2.150258
H  0.347695 -0.569158 -1.353308
totalener: -2137.11842978 hartree
nucrepener: 3930.19549334 hartree
electener: -6067.31392312 hartree
twoeener: 4687.76504447 hartree
kineticenergy: 2129.62604070 hartree
xcener: -175.403908545664 hartree
chargesum: 0.0000000
charge: 0.861930 -0.173374 -0.165811 -0.164112 -0.475438 -0.433372 -0.249569 -0.374826 -0.403115 -0.250274 -0.206073 -0.167691 -0.115699 -0.434854 -0.436493 -0.373835 -0.310349 0.173831 0.186291 -0.138467 -0.200357 -0.201275 -0.085344 0.377556 0.362106 0.379931 0.408241 0.391947 -0.168854 -0.186505 -0.138733 -0.033540 0.470843 0.109159 0.115949 0.068630 0.107261 0.131085 0.130379 0.168139 0.099612 0.095785 0.114710 0.103401 0.102389 0.126931 0.106673 0.112699 0.125514 0.126905 0.112673 0.217388
qa: 0.8619 -0.1734 -0.1658 -0.1641 -0.4754 -0.4334 -0.2496 -0.3748 -0.4031 -0.2503 -0.2061 -0.1677 -0.1157 -0.4349 -0.4365 -0.3738 -0.3103 0.1738 0.1863 -0.1385 -0.2004 -0.2013 -0.0853 0.3776 0.3621 0.3799 0.4082 0.3919 -0.1689 -0.1865 -0.1387 -0.0335 0.4708 0.1092 0.1159 0.0686 0.1073 0.1311 0.1304 0.1681 0.0996 0.0958 0.1147 0.1034 0.1024 0.1269 0.1067 0.1127 0.1255 0.1269 0.1127 0.2174
va: 5.8225 1.1335 1.1405 1.1390 2.0106 2.0734 2.1380 2.1128 2.1111 2.1519 3.1127 3.1905 3.2022 2.9717 2.9301 2.9768 3.8681 3.6554 3.6074 3.9721 4.0904 3.8908 3.9427 4.1351 4.3804 4.2324 4.0700 4.3035 3.8913 3.8810 3.9008 3.9107 4.4375 1.0096 1.0189 1.0035 1.0042 1.0118 0.9997 1.0361 1.0069 1.0033 0.9989 0.9871 0.9870 1.0263 0.9925 0.9932 0.9959 1.0045 1.0312 1.0428
dispcorr: -0.030431272 hartree
energy: -2137.148861056216
dipole: 27.90828 -27.78493 0.12335 2.50150 -1.28908 1.21242 -24.96821 24.78070 -0.18751
magnitude: 1.23302 au
magnitude: 3.13409 debye
