program: Orca
programVersion: 5.0.2
elementType: S F F F O O O O O O N N N N N N C C C C C C C C C C C C C C C C C H H H H H H H H H H H H H H H H H H H
charge: 0
multiplicity: 1
keywords: wb97x-d3
keywords: def2-TZVPP
keywords: def2/J RIJCOSX
keywords: DEFGRID2
keywords: scfconv7
keywords: smallprint printgap noloewdin
keywords: NOSOSCF
formula: C17H19F3N6O6S
InChI: InChI=1S/C17H19F3N6O6S/c1-9-6-5-7-10(12(27)31-4)11(9)33(29,30)25-15(28)22-13-21-14(26(2)3)24-16(23-13)32-8-17(18,19)20/h5-7,22,25H,8H2,1-4H3
52 atoms
S  2.200228 -0.488498 -1.390563
F  -2.2205 4.186452 0.795119
F  -2.66733 4.080367 -1.305481
F  -0.628467 4.339233 -0.65289
O  2.071289 0.955162 -1.368083
O  2.548352 -1.167415 -2.610327
O  3.0258 2.159617 1.336833
O  1.185481 0.892179 1.448992
O  1.114927 -3.251915 -0.827153
O  -2.816357 1.649646 -0.076358
N  0.69688 -1.012846 -0.871226
N  -0.967793 -2.55108 -0.345344
N  -5.396171 -1.98655 0.605509
N  -3.16583 -2.287655 0.133559
N  -1.821272 -0.389406 -0.236847
N  -4.104157 -0.121342 0.265206
C  3.310498 -0.953162 -0.070945
C  4.191844 -2.037554 -0.18067
C  3.311579 -0.127015 1.0591
C  5.035685 -2.274333 0.905788
C  4.186597 -0.385414 2.101102
C  4.33364 -2.943945 -1.369513
C  5.038913 -1.472547 2.028368
C  2.365956 1.018685 1.265751
C  0.358423 -2.323041 -0.699885
C  -2.021631 -1.702109 -0.143988
C  -4.197766 -1.454729 0.329483
C  -2.910505 0.334185 -0.014196
C  -5.608078 -3.410806 0.697803
C  -6.568566 -1.169956 0.816769
C  2.258847 3.337629 1.560223
C  -1.557137 2.227421 -0.348145
C  -1.784404 3.722477 -0.375429
H  5.717455 -3.112981 0.851875
H  4.198034 0.257457 2.970796
H  3.39179 -3.402467 -1.653918
H  5.039653 -3.737628 -1.131492
H  4.714563 -2.409072 -2.237208
H  5.715541 -1.686723 2.84468
H  -1.193144 -3.528863 -0.237169
H  -6.330111 -3.73646 -0.054513
H  -6.006155 -3.669272 1.681394
H  -4.678187 -3.94556 0.544387
H  -6.976841 -1.346664 1.814189
H  -7.339811 -1.422777 0.085805
H  -6.321852 -0.119128 0.719118
H  2.97566 4.150868 1.622267
H  1.575567 3.523219 0.732609
H  1.6905 3.279595 2.488441
H  -0.820852 1.979954 0.420941
H  -1.159302 1.908115 -1.315586
H  0.007936 -0.298182 -0.622422
totalener: -2137.12023042 hartree
nucrepener: 3967.29205173 hartree
electener: -6104.41228215 hartree
twoeener: 4724.58954980 hartree
kineticenergy: 2129.62797234 hartree
xcener: -175.405010310426 hartree
chargesum: 0.0000000
charge: 0.860267 -0.167538 -0.163842 -0.174185 -0.473119 -0.428843 -0.246654 -0.390455 -0.403516 -0.235849 -0.209725 -0.166340 -0.115331 -0.431561 -0.454319 -0.374430 -0.289450 0.157688 0.179412 -0.138545 -0.198506 -0.200619 -0.085551 0.388459 0.365645 0.379850 0.393183 0.387721 -0.165546 -0.166422 -0.138623 -0.031954 0.485133 0.109169 0.115999 0.132513 0.068230 0.107528 0.131250 0.168020 0.097702 0.097152 0.120241 0.095845 0.095324 0.130509 0.123694 0.110891 0.111909 0.109946 0.113713 0.213932
qa: 0.8603 -0.1675 -0.1638 -0.1742 -0.4731 -0.4288 -0.2467 -0.3905 -0.4035 -0.2358 -0.2097 -0.1663 -0.1153 -0.4316 -0.4543 -0.3744 -0.2894 0.1577 0.1794 -0.1385 -0.1985 -0.2006 -0.0856 0.3885 0.3656 0.3798 0.3932 0.3877 -0.1655 -0.1664 -0.1386 -0.0320 0.4851 0.1092 0.1160 0.1325 0.0682 0.1075 0.1313 0.1680 0.0977 0.0972 0.1202 0.0958 0.0953 0.1305 0.1237 0.1109 0.1119 0.1099 0.1137 0.2139
va: 5.8215 1.1407 1.1475 1.1256 2.0111 2.0806 2.1460 2.1052 2.1101 2.1635 3.1123 3.1787 3.2278 2.9789 2.9364 2.9798 3.8545 3.6776 3.6299 3.9678 4.0886 3.8912 3.9398 4.1302 4.3768 4.2257 4.1167 4.2924 3.8724 3.8677 3.8885 3.9002 4.4753 1.0099 1.0177 1.0113 1.0038 1.0041 0.9994 1.0368 0.9931 0.9929 1.0279 0.9931 0.9927 1.0265 0.9977 1.0034 0.9928 1.0295 1.0094 1.0433
dispcorr: -0.030098382 hartree
energy: -2137.150328806365
dipole: 0.11399 -0.74776 -0.63377 -27.74731 26.71741 -1.02990 10.20700 -8.51011 1.69689
magnitude: 2.08370 au
magnitude: 5.29634 debye
