program: Orca
programVersion: 5.0.2
elementType: S F F F O O O O O O N N N N N N C C C C C C C C C C C C C C C C C H H H H H H H H H H H H H H H H H H H
charge: 0
multiplicity: 1
keywords: wb97x-d3
keywords: def2-TZVPP
keywords: def2/J RIJCOSX
keywords: DEFGRID2
keywords: scfconv7
keywords: smallprint printgap noloewdin
keywords: NOSOSCF
formula: C17H19F3N6O6S
InChI: InChI=1S/C17H19F3N6O6S/c1-9-6-5-7-10(12(27)31-4)11(9)33(29,30)25-15(28)22-13-21-14(26(2)3)24-16(23-13)32-8-17(18,19)20/h5-7,22,25H,8H2,1-4H3
52 atoms
S  2.120861 -0.08061 -1.255085
F  -1.200575 2.082904 -1.895065
F  -0.189021 3.723702 -0.918591
F  -2.278184 3.881273 -1.425445
O  2.00927 1.339887 -0.990855
O  2.458927 -0.552285 -2.571432
O  2.95943 2.067325 1.827722
O  1.114447 0.802223 1.788566
O  1.070856 -2.895145 -1.020358
O  -2.914429 1.833901 0.406305
N  0.619387 -0.673142 -0.813988
N  -1.009847 -2.284019 -0.421007
N  -5.432233 -1.902046 0.62162
N  -3.204069 -2.109555 0.10184
N  -1.881139 -0.164021 -0.016736
N  -4.168236 0.012188 0.496665
C  3.228932 -0.770923 -0.037331
C  4.107685 -1.820364 -0.335647
C  3.229613 -0.155804 1.219725
C  4.953444 -2.242425 0.691365
C  4.101911 -0.594316 2.201445
C  4.243189 -2.507857 -1.663889
C  4.954911 -1.651141 1.937846
C  2.292952 0.948683 1.6085
C  0.30364 -1.997814 -0.777893
C  -2.067689 -1.478624 -0.099772
C  -4.244427 -1.321298 0.401277
C  -2.978693 0.51433 0.284966
C  -5.620412 -3.33067 0.539611
C  -6.612906 -1.139416 0.953078
C  2.192633 3.217302 2.1647
C  -1.670892 2.499802 0.396171
C  -1.338022 3.043371 -0.982369
H  5.636147 -3.05765 0.490609
H  4.112292 -0.113892 3.170541
H  4.610055 -1.830183 -2.432028
H  3.300761 -2.919544 -2.011406
H  4.957737 -3.32389 -1.571358
H  5.632341 -2.004138 2.703765
H  -1.225048 -3.26983 -0.435768
H  -4.69356 -3.822784 0.269522
H  -6.377572 -3.569316 -0.210685
H  -5.961555 -3.724331 1.499833
H  -7.025887 -1.48364 1.903819
H  -7.378416 -1.271442 0.184941
H  -6.374011 -0.085324 1.033212
H  1.525372 3.489067 1.346721
H  1.608627 3.063933 3.072503
H  2.909764 4.017316 2.323772
H  -1.780172 3.346276 1.076259
H  -0.852837 1.876769 0.760549
H  -0.088749 0.002549 -0.516411
totalener: -2137.11666257 hartree
nucrepener: 4054.38703007 hartree
electener: -6191.50369264 hartree
twoeener: 4812.27388615 hartree
kineticenergy: 2129.62426436 hartree
xcener: -175.404948722776 hartree
chargesum: -0.0000000
charge: 0.861309 -0.164110 -0.167472 -0.168653 -0.469344 -0.430182 -0.243557 -0.386063 -0.406704 -0.252498 -0.199218 -0.166799 -0.114808 -0.432448 -0.443836 -0.371709 -0.302803 0.167334 0.191694 -0.139774 -0.197547 -0.199247 -0.088044 0.377754 0.364030 0.378773 0.391697 0.393439 -0.165724 -0.166886 -0.141230 -0.052226 0.493341 0.108571 0.115260 0.106962 0.130693 0.068381 0.130346 0.167401 0.121087 0.097080 0.096513 0.093924 0.097148 0.128871 0.108667 0.109928 0.125563 0.129469 0.106013 0.209633
qa: 0.8613 -0.1641 -0.1675 -0.1687 -0.4693 -0.4302 -0.2436 -0.3861 -0.4067 -0.2525 -0.1992 -0.1668 -0.1148 -0.4324 -0.4438 -0.3717 -0.3028 0.1673 0.1917 -0.1398 -0.1975 -0.1992 -0.0880 0.3778 0.3640 0.3788 0.3917 0.3934 -0.1657 -0.1669 -0.1412 -0.0522 0.4933 0.1086 0.1153 0.1070 0.1307 0.0684 0.1303 0.1674 0.1211 0.0971 0.0965 0.0939 0.0971 0.1289 0.1087 0.1099 0.1256 0.1295 0.1060 0.2096
va: 5.8196 1.1358 1.1348 1.1390 2.0185 2.0780 2.1425 2.1051 2.1082 2.1624 3.1211 3.1810 3.2255 2.9783 2.9272 2.9735 3.8735 3.6601 3.6055 3.9678 4.0891 3.8922 3.9403 4.1457 4.3786 4.2263 4.1211 4.2794 3.8724 3.8690 3.8920 3.9670 4.3857 1.0100 1.0170 1.0047 1.0112 1.0035 0.9996 1.0372 1.0281 0.9927 0.9932 0.9926 0.9929 1.0269 0.9995 0.9927 0.9979 1.0069 1.0244 1.0440
dispcorr: -0.031658691 hartree
energy: -2137.148321260672
dipole: -3.52107 2.64597 -0.87510 -22.83687 22.03855 -0.79832 16.30174 -14.09305 2.20869
magnitude: 2.50628 au
magnitude: 6.37045 debye
