program: Orca
programVersion: 4.2.1
elementType: S S O O O O O O O N N N N N C C C C C C C C C C C C C C H H H H H H H H H H H H H H H H H
charge: 0
multiplicity: 1
keywords: wb97x-d3
keywords: def2-TZVPP
keywords: def2/J RIJCOSX GRIDX6 NOFINALGRIDX
keywords: grid4 nofinalgrid
keywords: scfconv7
keywords: smallprint printgap noloewdin
keywords: NOSOSCF
formula: C14H17N5O7S2
InChI: InChI=1S/C14H17N5O7S2/c1-4-27(21,22)9-6-5-7-15-12(9)28(23,24)19-14(20)18-13-16-10(25-2)8-11(17-13)26-3/h5-8,18-19H,4H2,1-3H3
45 atoms
S  -4.352362 -0.225866 0.087209
S  -0.992677 -1.056706 -0.600417
O  -5.621526 0.491865 -0.024575
O  -4.221428 -1.466028 -0.668769
O  -1.675755 -1.830869 0.409157
O  -0.755776 -1.619315 -1.913394
O  -0.30364 0.450439 1.779248
O  4.304182 -1.442953 -2.023327
O  6.475304 0.814506 1.402995
N  -0.927046 1.397768 -1.379339
N  0.505319 -0.634907 -0.037829
N  1.930051 0.444558 1.445916
N  3.100494 -0.501951 -0.323208
N  4.196041 0.636522 1.429538
C  -3.080162 0.898494 -0.49048
C  -4.023793 -0.454338 1.833417
C  -1.771614 0.561872 -0.821735
C  -3.474683 2.209648 -0.72753
C  -4.800593 -1.644128 2.366674
C  -2.577471 3.100551 -1.285875
C  -1.31358 2.644176 -1.613133
C  0.647083 0.10512 1.10586
C  3.125901 0.174071 0.811953
C  4.274191 -0.758218 -0.892937
C  5.358454 0.381145 0.844214
C  5.470409 -0.333221 -0.342901
C  3.075329 -1.89377 -2.589918
C  6.401098 1.559617 2.616704
H  -4.329866 0.481153 2.303506
H  -2.95268 -0.573821 1.975551
H  -4.475923 2.535195 -0.484309
H  -4.635597 -1.704164 3.441316
H  -4.460698 -2.578739 1.924287
H  -5.873139 -1.544872 2.204767
H  -2.860474 4.124763 -1.477457
H  1.342486 -0.801479 -0.614184
H  -0.588109 3.295893 -2.08061
H  2.006134 0.982558 2.299128
H  6.424434 -0.541476 -0.804218
H  2.429977 -1.059731 -2.867553
H  2.544954 -2.568914 -1.917904
H  3.34851 -2.438623 -3.489037
H  5.83568 2.482068 2.488959
H  7.428278 1.803354 2.872689
H  5.960749 0.974565 3.423329
elementType: S O N C H
totalener: -2140.62692918 hartree
nucrepener: 3228.49953312 hartree
electener: -5369.12646230 hartree
oneelecener: -9360.62627716 hartree
twoeener: 3991.49981486 hartree
cpcmener: -0.05984200 hartree
kineticenergy: 2133.49892670 hartree
xcener: -161.540802524713 hartree
chargesum: 0.0000000
charge: 0.861604 0.880716 -0.560497 -0.539904 -0.485614 -0.508600 -0.485172 -0.297482 -0.299847 -0.330128 -0.190014 -0.128135 -0.434121 -0.428493 -0.096412 -0.120590 0.137969 -0.037366 -0.262017 -0.130864 0.064479 0.378624 0.381754 0.426273 0.420188 -0.323477 -0.127593 -0.115554 0.141103 0.123985 0.159318 0.107570 0.099494 0.102468 0.173920 0.208050 0.160951 0.193435 0.148492 0.113805 0.114522 0.140534 0.114624 0.133257 0.114744
qa: 0.8616 0.8807 -0.5605 -0.5399 -0.4856 -0.5086 -0.4852 -0.2975 -0.2998 -0.3301 -0.1900 -0.1281 -0.4341 -0.4285 -0.0964 -0.1206 0.1380 -0.0374 -0.2620 -0.1309 0.0645 0.3786 0.3818 0.4263 0.4202 -0.3235 -0.1276 -0.1156 0.1411 0.1240 0.1593 0.1076 0.0995 0.1025 0.1739 0.2080 0.1610 0.1934 0.1485 0.1138 0.1145 0.1405 0.1146 0.1333 0.1147
va: 5.5000 5.7634 1.9158 1.9085 1.9923 1.9752 2.0170 2.1320 2.1217 3.0287 3.0924 3.1967 2.9770 2.9697 3.8322 3.8146 3.9298 3.9492 3.9520 3.9194 3.9978 4.3853 4.2320 3.9812 4.0161 3.9298 3.8401 3.8451 1.0133 1.0264 1.0104 1.0006 1.0105 1.0096 0.9852 1.0740 0.9902 1.0162 1.0152 0.9932 0.9924 0.9958 0.9953 0.9932 0.9953
dispcorr: -0.025420959 hartree
energy: -2140.652350140545
dipole: 6.20372 -2.79924 3.40448 3.20092 0.36721 3.56813 8.56550 -7.25698 1.30852
magnitude: 5.10238 au
magnitude: 12.96921 debye
