program: Orca
programVersion: 4.2.1
elementType: S S O O O O O O O N N N N N C C C C C C C C C C C C C C H H H H H H H H H H H H H H H H H
charge: 0
multiplicity: 1
keywords: wb97x-d3
keywords: def2-TZVPP
keywords: def2/J RIJCOSX GRIDX6 NOFINALGRIDX
keywords: grid4 nofinalgrid
keywords: scfconv7
keywords: smallprint printgap noloewdin
keywords: NOSOSCF
formula: C14H17N5O7S2
InChI: InChI=1S/C14H17N5O7S2/c1-4-27(21,22)9-6-5-7-15-12(9)28(23,24)19-14(20)18-13-16-10(25-2)8-11(17-13)26-3/h5-8,18-19H,4H2,1-3H3
45 atoms
S  -4.173948 0.436417 -1.502812
S  -0.901651 -0.915384 -1.153336
O  -4.050339 -0.866944 -2.120606
O  -5.477279 0.917058 -1.061044
O  -0.882052 -2.33872 -0.92185
O  -1.228051 -0.348038 -2.433359
O  0.186637 1.824868 -0.856079
O  3.603933 -3.054729 1.124023
O  6.249762 0.66945 1.957161
N  -1.29004 -0.245564 1.313961
N  0.621161 -0.40569 -0.711212
N  2.185586 1.171421 -0.033414
N  2.879972 -0.973915 0.531354
N  4.216509 0.923373 0.955939
C  -3.15503 0.429926 -0.005822
C  -3.481692 1.719718 -2.547783
C  -1.902561 -0.153053 0.154415
C  -3.75445 0.954658 1.133125
C  -3.407247 3.06413 -1.851185
C  -3.102534 0.877539 2.350016
C  -1.868138 0.253612 2.392296
C  0.928454 0.92008 -0.562461
C  3.129127 0.324813 0.502692
C  3.812297 -1.753852 1.068782
C  5.138472 0.133259 1.486466
C  4.997354 -1.247134 1.576748
C  2.391006 -3.579718 0.598716
C  6.41211 2.076513 1.87488
H  -4.166298 1.73828 -3.399971
H  -2.510741 1.378645 -2.89356
H  -4.732781 1.408568 1.058713
H  -4.374794 3.376062 -1.462723
H  -3.074676 3.81509 -2.566655
H  -2.679145 3.052165 -1.040849
H  -3.549533 1.281084 3.247415
H  1.240373 -1.085699 -0.258654
H  -1.323125 0.148919 3.322536
H  2.418739 2.151363 0.022834
H  5.756599 -1.878798 2.011285
H  1.515349 -3.1816 1.113208
H  2.442054 -4.652617 0.760427
H  2.29233 -3.385319 -0.470058
H  6.395443 2.426517 0.842488
H  7.384531 2.284935 2.312784
H  5.64055 2.606203 2.434361
totalener: -2140.59448782 hartree
nucrepener: 3245.87780891 hartree
electener: -5386.47229674 hartree
oneelecener: -9393.99132135 hartree
twoeener: 4007.51902461 hartree
kineticenergy: 2133.56178535 hartree
xcener: -161.539774986153 hartree
chargesum: -0.0000000
charge: 0.830434 0.876786 -0.444390 -0.493707 -0.445144 -0.438486 -0.389477 -0.260480 -0.262573 -0.313428 -0.201991 -0.161176 -0.425109 -0.407542 -0.185418 -0.161190 0.171291 -0.036172 -0.273098 -0.123695 0.037591 0.335418 0.362093 0.398529 0.385088 -0.300652 -0.129327 -0.125095 0.113046 0.158950 0.152252 0.106095 0.098159 0.098553 0.138943 0.199497 0.128113 0.166693 0.130273 0.108929 0.129276 0.111115 0.109101 0.124737 0.107189
qa: 0.8304 0.8768 -0.4444 -0.4937 -0.4451 -0.4385 -0.3895 -0.2605 -0.2626 -0.3134 -0.2020 -0.1612 -0.4251 -0.4075 -0.1854 -0.1612 0.1713 -0.0362 -0.2731 -0.1237 0.0376 0.3354 0.3621 0.3985 0.3851 -0.3007 -0.1293 -0.1251 0.1130 0.1589 0.1523 0.1061 0.0982 0.0986 0.1389 0.1995 0.1281 0.1667 0.1303 0.1089 0.1293 0.1111 0.1091 0.1247 0.1072
va: 5.5856 5.7800 2.0382 1.9866 2.0519 2.0550 2.1168 2.1617 2.1516 3.0325 3.1073 3.1663 2.9769 2.9752 3.8873 3.8373 3.8582 3.9266 3.9483 3.9101 4.0402 4.4035 4.2451 4.0217 4.0578 3.9352 3.8652 3.8753 1.0217 1.0213 1.0216 1.0107 1.0051 1.0035 0.9980 1.0760 0.9971 1.0365 1.0216 0.9981 0.9959 0.9953 0.9966 0.9942 0.9968
dispcorr: -0.026290565 hartree
energy: -2140.620778389783
dipole: 7.75885 -5.58076 2.17809 10.74528 -9.17226 1.57302 5.56824 -3.37125 2.19699
magnitude: 3.47062 au
magnitude: 8.82163 debye
