program: Orca
programVersion: 4.2.1
elementType: S S O O O O O O O N N N N N C C C C C C C C C C C C C C H H H H H H H H H H H H H H H H H
charge: 0
multiplicity: 1
keywords: wb97x-d3
keywords: def2-TZVPP
keywords: def2/J RIJCOSX GRIDX6 NOFINALGRIDX
keywords: grid4 nofinalgrid
keywords: scfconv7
keywords: smallprint printgap noloewdin
keywords: NOSOSCF
formula: C14H17N5O7S2
InChI: InChI=1S/C14H17N5O7S2/c1-4-27(21,22)9-6-5-7-15-12(9)28(23,24)19-14(20)18-13-16-10(25-2)8-11(17-13)26-3/h5-8,18-19H,4H2,1-3H3
45 atoms
S  -3.845996 1.822391 -1.304489
S  -0.334285 1.468409 -0.860569
O  -5.246133 1.888444 -0.904535
O  -3.125935 3.035558 -1.628347
O  -0.818599 1.425722 -2.213606
O  0.310256 2.63452 -0.30835
O  -0.615038 -1.452987 -1.256861
O  5.190683 -3.817498 1.338039
O  4.558875 0.780822 1.502759
N  -1.09508 0.489824 1.408742
N  0.774581 0.244525 -0.647842
N  1.424504 -1.975876 -0.440198
N  3.305235 -2.898381 0.442778
N  2.993665 -0.561641 0.528353
C  -3.002692 1.039951 0.092276
C  -3.746203 0.628098 -2.639173
C  -1.630375 0.950239 0.299857
C  -3.824801 0.590821 1.118854
C  -4.366747 -0.706126 -2.274754
C  -3.263733 0.085635 2.277126
C  -1.88396 0.065149 2.38024
C  0.442504 -1.072637 -0.8182
C  2.627003 -1.790026 0.203234
C  4.463501 -2.748522 1.068986
C  4.156347 -0.42635 1.157329
C  4.960889 -1.511511 1.464373
C  4.70113 -5.088619 0.94112
C  3.735058 1.896245 1.185774
H  -2.702162 0.534882 -2.923031
H  -4.282435 1.120162 -3.454994
H  -4.898277 0.650651 1.005472
H  -4.344758 -1.356575 -3.148279
H  -5.402956 -0.601139 -1.959198
H  -3.800901 -1.208129 -1.490393
H  -3.884733 -0.272488 3.085851
H  1.615491 0.450481 -0.098988
H  -1.392506 -0.30279 3.272728
H  1.184796 -2.939851 -0.616629
H  5.906239 -1.404452 1.973425
H  4.5711 -5.153115 -0.139456
H  3.750489 -5.323969 1.420456
H  5.454218 -5.804532 1.259114
H  2.759786 1.836116 1.670869
H  3.589398 2.002793 0.110006
H  4.265242 2.76743 1.559653
totalener: -2140.59447584 hartree
nucrepener: 3246.28121939 hartree
electener: -5386.87569523 hartree
oneelecener: -9394.79635925 hartree
twoeener: 4007.92066402 hartree
kineticenergy: 2133.56464544 hartree
xcener: -161.540448917217 hartree
chargesum: 0.0000000
charge: 0.831309 0.876509 -0.493303 -0.444534 -0.437841 -0.445347 -0.389596 -0.262221 -0.260433 -0.313368 -0.201434 -0.161012 -0.407345 -0.424425 -0.181887 -0.160467 0.168931 -0.039168 -0.273103 -0.121812 0.036886 0.334838 0.361853 0.384232 0.396317 -0.298042 -0.125414 -0.130997 0.158076 0.111997 0.151577 0.098616 0.107364 0.096904 0.139470 0.199076 0.128421 0.166587 0.130650 0.109245 0.107237 0.124670 0.110299 0.111042 0.129645
qa: 0.8313 0.8765 -0.4933 -0.4445 -0.4378 -0.4453 -0.3896 -0.2622 -0.2604 -0.3134 -0.2014 -0.1610 -0.4073 -0.4244 -0.1819 -0.1605 0.1689 -0.0392 -0.2731 -0.1218 0.0369 0.3348 0.3619 0.3842 0.3963 -0.2980 -0.1254 -0.1310 0.1581 0.1120 0.1516 0.0986 0.1074 0.0969 0.1395 0.1991 0.1284 0.1666 0.1306 0.1092 0.1072 0.1247 0.1103 0.1110 0.1296
va: 5.5878 5.7810 1.9875 2.0386 2.0550 2.0515 2.1166 2.1519 2.1621 3.0323 3.1057 3.1665 2.9745 2.9769 3.8886 3.8373 3.8610 3.9274 3.9491 3.9082 4.0398 4.4044 4.2446 4.0585 4.0235 3.9328 3.8755 3.8644 1.0230 1.0221 1.0215 1.0047 1.0103 1.0029 0.9978 1.0761 0.9970 1.0366 1.0214 0.9965 0.9969 0.9942 0.9978 0.9952 0.9958
dispcorr: -0.026285269 hartree
energy: -2140.620761110195
dipole: 1.78956 -0.64123 1.14834 -14.10528 11.25382 -2.85146 2.48136 -0.83548 1.64588
magnitude: 3.48690 au
magnitude: 8.86298 debye
